program: Orca
programVersion: 5.0.2
elementType: O O C C C C C C C C C H H H H H H H H H H H H H H H H H H
charge: 0
multiplicity: 1
keywords: wb97x-d3
keywords: def2-TZVPP
keywords: def2/J RIJCOSX
keywords: DEFGRID2
keywords: scfconv7
keywords: smallprint printgap noloewdin
keywords: NOSOSCF
formula: C9H18O2
InChI: InChI=1/C9H18O2/c1-2-3-4-5-6-7-8-9(10)11/h10H,2-8H2,1H3
29 atoms
O  -2.059748 -2.44022 -0.673026
O  -3.754936 -1.000803 -0.532739
C  0.332567 0.61988 -0.89569
C  1.337411 1.06483 0.159262
C  -1.068392 1.194668 -0.702872
C  2.749949 0.569526 -0.119917
C  -1.741777 0.835507 0.619896
C  3.762795 1.016175 0.925833
C  -1.849308 -0.666143 0.883647
C  5.170086 0.518367 0.635226
C  -2.658303 -1.364738 -0.170746
H  0.695878 0.923684 -1.882264
H  0.290901 -0.473765 -0.921928
H  1.340607 2.159204 0.214465
H  1.026685 0.712284 1.148064
H  -1.018832 2.285088 -0.775851
H  -1.702117 0.871375 -1.534443
H  2.746544 -0.524562 -0.175395
H  3.070192 0.922166 -1.106376
H  -2.738534 1.28048 0.646987
H  -1.192728 1.279428 1.452369
H  3.446032 0.661908 1.911438
H  3.76587 2.1089 0.982586
H  -2.362279 -0.825983 1.836544
H  -0.864138 -1.1218 0.97793
H  5.527736 0.882781 -0.329528
H  5.206089 -0.572258 0.607334
H  5.878851 0.850837 1.394689
H  -2.631115 -2.85669 -1.337943
elementType: O C H
totalener: -504.35117706 hartree
nucrepener: 628.81763007 hartree
electener: -1133.16880713 hartree
oneelecener: -1930.51175373 hartree
twoeener: 797.34294660 hartree
cpcmener: -0.02111124 hartree
kineticenergy: 501.95501676 hartree
xcener: -49.764466234430 hartree
chargesum: -0.0000000
charge: -0.305374 -0.490249 -0.112613 -0.122053 -0.165271 -0.112780 -0.152939 -0.072654 -0.126620 -0.283043 0.416801 0.076404 0.061486 0.062255 0.059119 0.078366 0.082734 0.057543 0.056091 0.086207 0.086498 0.053242 0.052960 0.118487 0.087262 0.077037 0.077648 0.089666 0.263792
qa: -0.3054 -0.4902 -0.1126 -0.1221 -0.1653 -0.1128 -0.1529 -0.0727 -0.1266 -0.2830 0.4168 0.0764 0.0615 0.0623 0.0591 0.0784 0.0827 0.0575 0.0561 0.0862 0.0865 0.0532 0.0530 0.1185 0.0873 0.0770 0.0776 0.0897 0.2638
va: 2.1722 1.9956 3.8556 3.8640 3.8904 3.8807 3.8992 3.8699 3.8373 3.9477 4.1680 1.0111 1.0129 1.0113 1.0081 1.0080 1.0146 1.0085 1.0095 1.0203 1.0053 1.0072 1.0075 1.0094 1.0194 1.0008 1.0006 1.0041 0.9885
dispcorr: -0.010426476 hartree
energy: -504.361603535446
dipole: 19.12170 -18.21157 0.91013 8.08144 -8.39569 -0.31425 2.91225 -2.66517 0.24707
magnitude: 0.99404 au
magnitude: 2.52666 debye
