program: Orca
programVersion: 5.0.2
elementType: O O C C C C C C C C C H H H H H H H H H H H H H H H H H H
charge: 0
multiplicity: 1
keywords: wb97x-d3
keywords: def2-TZVPP
keywords: def2/J RIJCOSX
keywords: DEFGRID2
keywords: scfconv7
keywords: smallprint printgap noloewdin
keywords: NOSOSCF
formula: C9H18O2
InChI: InChI=1/C9H18O2/c1-2-3-4-5-6-7-8-9(10)11/h10H,2-8H2,1H3
29 atoms
O  -3.411137 -2.595316 0.81581
O  -4.061965 -1.161824 -0.763085
C  0.375199 1.131644 0.634631
C  1.753932 1.784179 0.596178
C  -0.1284 0.68432 -0.733153
C  2.877355 0.853494 0.156379
C  -1.58085 0.220617 -0.747196
C  4.248827 1.514804 0.19843
C  -1.814746 -1.022438 0.097315
C  5.369437 0.58319 -0.236788
C  -3.206453 -1.571562 -0.012697
H  0.401807 0.282282 1.324744
H  -0.341714 1.842927 1.057921
H  1.722453 2.654377 -0.068872
H  1.988502 2.174292 1.591608
H  -0.028132 1.518722 -1.434348
H  0.504804 -0.117494 -1.124799
H  2.883365 -0.0342 0.799112
H  2.690437 0.490105 -0.858917
H  -1.872606 0.018172 -1.78003
H  -2.225056 1.031513 -0.395466
H  4.446304 1.876138 1.212313
H  4.241563 2.401997 -0.442218
H  -1.608627 -0.831762 1.15382
H  -1.121423 -1.818476 -0.195925
H  5.425819 -0.296528 0.407272
H  6.341044 1.077733 -0.201492
H  5.217679 0.230903 -1.25886
H  -4.315092 -2.931306 0.711902
elementType: O C H
totalener: -504.35181600 hartree
nucrepener: 607.61082967 hartree
electener: -1111.96264566 hartree
oneelecener: -1888.09884341 hartree
twoeener: 776.13619775 hartree
cpcmener: -0.02124320 hartree
kineticenergy: 501.94938379 hartree
xcener: -49.762906062389 hartree
chargesum: -0.0000000
charge: -0.316143 -0.481964 -0.124562 -0.140463 -0.135980 -0.102813 -0.124535 -0.087463 -0.126893 -0.278114 0.419659 0.065070 0.074315 0.061462 0.070327 0.076080 0.068475 0.056316 0.059422 0.073432 0.072272 0.054313 0.054367 0.101294 0.105141 0.077574 0.089842 0.077289 0.262279
qa: -0.3161 -0.4820 -0.1246 -0.1405 -0.1360 -0.1028 -0.1245 -0.0875 -0.1269 -0.2781 0.4197 0.0651 0.0743 0.0615 0.0703 0.0761 0.0685 0.0563 0.0594 0.0734 0.0723 0.0543 0.0544 0.1013 0.1051 0.0776 0.0898 0.0773 0.2623
va: 2.1747 2.0002 3.8855 3.9100 3.9135 3.8552 3.9083 3.8822 3.8131 3.9450 4.2018 1.0075 1.0103 1.0092 1.0103 1.0095 1.0076 1.0081 1.0081 1.0205 1.0144 1.0079 1.0066 1.0196 1.0131 1.0008 1.0044 1.0011 0.9899
dispcorr: -0.009498345 hartree
energy: -504.361314342204
dipole: 22.75627 -22.07273 0.68354 8.95211 -9.33007 -0.37796 0.38417 0.27448 0.65866
magnitude: 1.02172 au
magnitude: 2.59700 debye
