program: Orca
programVersion: 5.0.2
elementType: O O C C C C C C C C C H H H H H H H H H H H H H H H H H H
charge: 0
multiplicity: 1
keywords: wb97x-d3
keywords: def2-TZVPP
keywords: def2/J RIJCOSX
keywords: DEFGRID2
keywords: scfconv7
keywords: smallprint printgap noloewdin
keywords: NOSOSCF
formula: C9H18O2
InChI: InChI=1/C9H18O2/c1-2-3-4-5-6-7-8-9(10)11/h10H,2-8H2,1H3
29 atoms
O  -3.129123 -2.269227 0.32949
O  -3.549515 -1.195762 -1.578775
C  0.899486 0.353618 0.313498
C  1.940346 0.393558 -0.799304
C  -0.519758 0.187513 -0.21444
C  3.384334 0.440583 -0.310013
C  -1.560282 0.176998 0.897749
C  3.74891 1.699302 0.468751
C  -3.001017 0.082098 0.388983
C  5.214923 1.726961 0.873751
C  -3.259606 -1.165045 -0.404214
H  1.130998 -0.471333 0.996217
H  0.9526 1.268088 0.911897
H  1.812608 -0.490447 -1.431966
H  1.746779 1.257193 -1.444717
H  -0.747434 0.997999 -0.91475
H  -0.577131 -0.740951 -0.792953
H  3.584233 -0.439188 0.311669
H  4.052555 0.356507 -1.172966
H  -1.478375 1.099332 1.477545
H  -1.353622 -0.639039 1.594442
H  3.126997 1.78082 1.364023
H  3.520543 2.579555 -0.140429
H  -3.231619 0.939682 -0.242629
H  -3.689442 0.10354 1.237721
H  5.465902 0.875058 1.50876
H  5.46218 2.633033 1.428451
H  5.869082 1.687281 0.000638
H  -3.286332 -3.053582 -0.218649
elementType: O C H
totalener: -504.35168667 hartree
nucrepener: 612.06220957 hartree
electener: -1116.41389624 hartree
oneelecener: -1897.04730343 hartree
twoeener: 780.63340719 hartree
cpcmener: -0.02119915 hartree
kineticenergy: 501.95001714 hartree
xcener: -49.761746776153 hartree
chargesum: -0.0000000
charge: -0.308351 -0.481690 -0.120958 -0.114481 -0.124643 -0.140229 -0.119094 -0.076912 -0.127775 -0.286516 0.405148 0.061844 0.064069 0.069262 0.061716 0.066061 0.064429 0.060409 0.070535 0.078947 0.075285 0.057329 0.056188 0.084195 0.116222 0.078361 0.089645 0.078489 0.262517
qa: -0.3084 -0.4817 -0.1210 -0.1145 -0.1246 -0.1402 -0.1191 -0.0769 -0.1278 -0.2865 0.4051 0.0618 0.0641 0.0693 0.0617 0.0661 0.0644 0.0604 0.0705 0.0789 0.0753 0.0573 0.0562 0.0842 0.1162 0.0784 0.0896 0.0785 0.2625
va: 2.1569 1.9984 3.8789 3.8889 3.8860 3.8989 3.8762 3.8515 3.8559 3.9482 4.1759 1.0086 1.0083 1.0116 1.0096 1.0082 1.0182 1.0078 1.0097 1.0127 1.0187 1.0078 1.0067 1.0255 1.0131 1.0003 1.0036 1.0012 0.9886
dispcorr: -0.009677272 hartree
energy: -504.361363943151
dipole: 21.10050 -20.76278 0.33772 8.96431 -9.03362 -0.06931 4.27234 -3.23257 1.03977
magnitude: 1.09544 au
magnitude: 2.78439 debye
