program: Orca
programVersion: 5.0.2
elementType: O O C C C C C C C C C H H H H H H H H H H H H H H H H H H
charge: 0
multiplicity: 1
keywords: wb97x-d3
keywords: def2-TZVPP
keywords: def2/J RIJCOSX
keywords: DEFGRID2
keywords: scfconv7
keywords: smallprint printgap noloewdin
keywords: NOSOSCF
formula: C9H18O2
InChI: InChI=1/C9H18O2/c1-2-3-4-5-6-7-8-9(10)11/h10H,2-8H2,1H3
29 atoms
O  -4.42611 -2.32296 0.212044
O  -4.262853 -0.142167 -0.221162
C  0.908252 0.808245 -0.235933
C  2.407108 0.560295 -0.127397
C  0.070252 -0.441669 -0.001186
C  3.234586 1.817423 -0.369123
C  -1.424281 -0.173772 -0.117948
C  4.742727 1.585586 -0.356613
C  -2.251147 -1.427061 0.115592
C  5.289706 1.169487 1.001968
C  -3.731134 -1.202799 0.012223
H  0.614795 1.580292 0.483626
H  0.679159 1.21596 -1.226491
H  2.631082 0.146726 0.860845
H  2.701223 -0.20794 -0.851391
H  0.361256 -1.215074 -0.719903
H  0.293393 -0.849355 0.990466
H  2.948144 2.247778 -1.333876
H  2.978918 2.570976 0.384346
H  -1.640635 0.2324 -1.109728
H  -1.709195 0.597095 0.603015
H  5.246029 2.501704 -0.676797
H  4.99779 0.826115 -1.10249
H  -2.042535 -1.848638 1.104048
H  -1.976685 -2.209799 -0.598453
H  6.376822 1.080163 0.981179
H  4.89347 0.206944 1.328115
H  5.037063 1.904931 1.768964
H  -5.3759 -2.140939 0.138742
elementType: O C H
totalener: -504.35297516 hartree
nucrepener: 596.19465546 hartree
electener: -1100.54763062 hartree
oneelecener: -1865.37844787 hartree
twoeener: 764.83081725 hartree
cpcmener: -0.02118456 hartree
kineticenergy: 501.94478073 hartree
xcener: -49.761031799212 hartree
chargesum: 0.0000000
charge: -0.314639 -0.481769 -0.115643 -0.119687 -0.116667 -0.111409 -0.094224 -0.111287 -0.140366 -0.277106 0.423700 0.059022 0.059314 0.062487 0.057389 0.062125 0.062873 0.066983 0.060439 0.065192 0.064346 0.069285 0.052722 0.103177 0.102991 0.091136 0.079357 0.078274 0.261985
qa: -0.3146 -0.4818 -0.1156 -0.1197 -0.1167 -0.1114 -0.0942 -0.1113 -0.1404 -0.2771 0.4237 0.0590 0.0593 0.0625 0.0574 0.0621 0.0629 0.0670 0.0604 0.0652 0.0643 0.0693 0.0527 0.1032 0.1030 0.0911 0.0794 0.0783 0.2620
va: 2.1777 2.0006 3.8890 3.8785 3.9176 3.8785 3.8847 3.8981 3.8440 3.9268 4.1975 1.0092 1.0107 1.0072 1.0088 1.0093 1.0095 1.0114 1.0085 1.0166 1.0169 1.0069 1.0088 1.0153 1.0154 1.0045 0.9986 1.0008 0.9895
dispcorr: -0.009085630 hartree
energy: -504.362060787239
dipole: 25.29360 -24.89078 0.40283 6.23182 -7.14633 -0.91451 0.96668 -0.79065 0.17603
magnitude: 1.01468 au
magnitude: 2.57912 debye
