program: Orca
programVersion: 5.0.2
elementType: O O C C C C C C C C C H H H H H H H H H H H H H H H H H H
charge: 0
multiplicity: 1
keywords: wb97x-d3
keywords: def2-TZVPP
keywords: def2/J RIJCOSX
keywords: DEFGRID2
keywords: scfconv7
keywords: smallprint printgap noloewdin
keywords: NOSOSCF
formula: C9H18O2
InChI: InChI=1/C9H18O2/c1-2-3-4-5-6-7-8-9(10)11/h10H,2-8H2,1H3
29 atoms
O  -3.143972 -2.49765 0.699089
O  -3.354133 -0.28186 0.825752
C  0.720289 1.420418 -0.25704
C  1.780072 1.621193 0.822138
C  -0.11838 0.162694 -0.071093
C  2.818102 0.50507 0.925437
C  -1.221626 0.035508 -1.11402
C  3.598525 0.228712 -0.357304
C  -2.052502 -1.230867 -0.964799
C  4.363637 1.435571 -0.882354
C  -2.900118 -1.258625 0.274954
H  0.056686 2.290933 -0.259439
H  1.18911 1.402554 -1.246635
H  2.285839 2.57531 0.64814
H  1.282981 1.724809 1.792001
H  0.519146 -0.725567 -0.121502
H  -0.550438 0.169108 0.935398
H  3.525438 0.762035 1.720525
H  2.332425 -0.419643 1.250068
H  -0.772669 0.025915 -2.110278
H  -1.871468 0.914166 -1.084953
H  2.923737 -0.142014 -1.134764
H  4.302559 -0.585477 -0.165977
H  -1.417599 -2.117892 -0.998781
H  -2.745689 -1.323571 -1.808233
H  3.696348 2.241063 -1.193342
H  4.973559 1.171773 -1.747523
H  5.033174 1.841405 -0.120573
H  -3.73565 -2.475833 1.467595
elementType: O C H
totalener: -504.35068788 hartree
nucrepener: 628.43289090 hartree
electener: -1132.78357878 hartree
oneelecener: -1929.94323519 hartree
twoeener: 797.15965641 hartree
cpcmener: -0.02090448 hartree
kineticenergy: 501.94455465 hartree
xcener: -49.764019808173 hartree
chargesum: -0.0000000
charge: -0.313231 -0.486553 -0.119803 -0.165385 -0.142056 -0.150895 -0.114793 -0.105111 -0.129143 -0.278798 0.414593 0.077806 0.067101 0.081130 0.075576 0.066904 0.069086 0.077404 0.074376 0.079488 0.066240 0.057383 0.070135 0.091376 0.120091 0.077908 0.092335 0.082208 0.264629
qa: -0.3132 -0.4866 -0.1198 -0.1654 -0.1421 -0.1509 -0.1148 -0.1051 -0.1291 -0.2788 0.4146 0.0778 0.0671 0.0811 0.0756 0.0669 0.0691 0.0774 0.0744 0.0795 0.0662 0.0574 0.0701 0.0914 0.1201 0.0779 0.0923 0.0822 0.2646
va: 2.1718 1.9924 3.8544 3.9001 3.8536 3.8820 3.8729 3.8747 3.8635 3.9333 4.1660 1.0112 1.0039 1.0010 1.0098 1.0067 1.0200 1.0071 1.0037 1.0142 1.0258 1.0038 1.0079 1.0227 1.0086 0.9984 1.0049 1.0008 0.9877
dispcorr: -0.010520773 hartree
energy: -504.361208656323
dipole: 19.50681 -19.18602 0.32079 7.05011 -7.92718 -0.87707 -3.96982 3.53894 -0.43089
magnitude: 1.02851 au
magnitude: 2.61426 debye
