program: Orca
programVersion: 5.0.2
elementType: O O C C C C C C C C C H H H H H H H H H H H H H H H H H H
charge: 0
multiplicity: 1
keywords: wb97x-d3
keywords: def2-TZVPP
keywords: def2/J RIJCOSX
keywords: DEFGRID2
keywords: scfconv7
keywords: smallprint printgap noloewdin
keywords: NOSOSCF
formula: C9H18O2
InChI: InChI=1/C9H18O2/c1-2-3-4-5-6-7-8-9(10)11/h10H,2-8H2,1H3
29 atoms
O  -1.425863 -2.599308 0.089134
O  -3.517749 -2.062522 -0.469613
C  0.20261 1.957735 -0.403463
C  1.352029 1.293334 0.344483
C  -1.14684 1.849496 0.301085
C  2.705258 1.546581 -0.309674
C  -1.623399 0.428162 0.582708
C  3.884328 0.928397 0.436385
C  -1.784457 -0.408162 -0.692743
C  3.890931 -0.593883 0.425298
C  -2.3508 -1.757054 -0.370199
H  0.432029 3.019033 -0.540721
H  0.136568 1.538741 -1.41292
H  1.376028 1.664181 1.375782
H  1.172126 0.216484 0.414181
H  -1.093657 2.384087 1.254226
H  -1.904457 2.366908 -0.294886
H  2.689595 1.166325 -1.337359
H  2.860862 2.627037 -0.39023
H  -2.584893 0.478057 1.099584
H  -0.933066 -0.072382 1.265302
H  3.885618 1.287144 1.470561
H  4.814992 1.289952 -0.008867
H  -0.820568 -0.526114 -1.191073
H  -2.460936 0.09697 -1.383199
H  3.026146 -1.013649 0.940788
H  4.781831 -0.988545 0.915786
H  3.882723 -0.978251 -0.59697
H  -1.83502 -3.444699 0.33138
elementType: O C H
totalener: -504.34978173 hartree
nucrepener: 628.40077532 hartree
electener: -1132.75055705 hartree
oneelecener: -1929.51789341 hartree
twoeener: 796.76733636 hartree
cpcmener: -0.02104067 hartree
kineticenergy: 501.94675655 hartree
xcener: -49.762764974018 hartree
chargesum: -0.0000000
charge: -0.307707 -0.484419 -0.137538 -0.120686 -0.157824 -0.117731 -0.157093 -0.101665 -0.105793 -0.279518 0.404791 0.075015 0.069428 0.063382 0.061650 0.075820 0.079813 0.061306 0.067944 0.098870 0.088617 0.051871 0.069441 0.099070 0.093533 0.078725 0.091463 0.079005 0.260232
qa: -0.3077 -0.4844 -0.1375 -0.1207 -0.1578 -0.1177 -0.1571 -0.1017 -0.1058 -0.2795 0.4048 0.0750 0.0694 0.0634 0.0616 0.0758 0.0798 0.0613 0.0679 0.0989 0.0886 0.0519 0.0694 0.0991 0.0935 0.0787 0.0915 0.0790 0.2602
va: 2.1604 1.9999 3.8771 3.8510 3.9124 3.8832 3.8697 3.8919 3.7952 3.9285 4.1978 1.0119 1.0010 1.0100 1.0030 1.0087 1.0077 1.0080 1.0122 1.0144 1.0087 1.0092 1.0069 1.0182 1.0264 0.9986 1.0045 1.0005 0.9915
dispcorr: -0.010316574 hartree
energy: -504.360098301559
dipole: 16.26641 -15.19963 1.06677 10.39725 -10.11548 0.28177 1.82933 -1.58082 0.24851
magnitude: 1.13100 au
magnitude: 2.87477 debye
