program: Orca
programVersion: 5.0.2
elementType: O O C C C C C C C C C H H H H H H H H H H H H H H H H H H
charge: 0
multiplicity: 1
keywords: wb97x-d3
keywords: def2-TZVPP
keywords: def2/J RIJCOSX
keywords: DEFGRID2
keywords: scfconv7
keywords: smallprint printgap noloewdin
keywords: NOSOSCF
formula: C9H18O2
InChI: InChI=1/C9H18O2/c1-2-3-4-5-6-7-8-9(10)11/h10H,2-8H2,1H3
29 atoms
O  -0.86913 -1.474919 -1.214872
O  -1.037073 -2.126542 0.90873
C  -0.04171 1.469664 0.745734
C  0.87208 1.571358 -0.472081
C  -1.490276 1.870856 0.480018
C  2.300305 1.102283 -0.202709
C  -2.291779 0.967594 -0.455243
C  2.446189 -0.410204 -0.07336
C  -2.549846 -0.443916 0.080922
C  3.87282 -0.833344 0.242051
C  -1.410424 -1.418268 -0.000377
H  -0.001916 0.46643 1.178322
H  0.355179 2.128852 1.523882
H  0.463488 1.00287 -1.312579
H  0.891245 2.615348 -0.799682
H  -2.020431 1.93083 1.435239
H  -1.50268 2.88394 0.066156
H  2.951285 1.44557 -1.012756
H  2.674445 1.584153 0.70778
H  -1.834699 0.923475 -1.445638
H  -3.268792 1.430376 -0.606305
H  2.123705 -0.880879 -1.007418
H  1.778782 -0.791169 0.704775
H  -3.368928 -0.890532 -0.492394
H  -2.883909 -0.399619 1.118047
H  3.966744 -1.918512 0.300758
H  4.204847 -0.423148 1.197676
H  4.569113 -0.484397 -0.523149
H  -0.139643 -2.114624 -1.225719
elementType: O C H
totalener: -504.34881564 hartree
nucrepener: 663.62558659 hartree
electener: -1167.97440223 hartree
oneelecener: -2000.18991286 hartree
twoeener: 832.21551064 hartree
cpcmener: -0.02070240 hartree
kineticenergy: 501.93586269 hartree
xcener: -49.762238899962 hartree
chargesum: 0.0000000
charge: -0.305371 -0.481339 -0.123546 -0.132939 -0.153231 -0.130822 -0.137764 -0.075244 -0.109834 -0.287612 0.394987 0.056466 0.084053 0.061206 0.079108 0.076549 0.072788 0.074053 0.056389 0.076920 0.090486 0.054740 0.048965 0.117694 0.081840 0.090217 0.078742 0.078512 0.263986
qa: -0.3054 -0.4813 -0.1235 -0.1329 -0.1532 -0.1308 -0.1378 -0.0752 -0.1098 -0.2876 0.3950 0.0565 0.0841 0.0612 0.0791 0.0765 0.0728 0.0741 0.0564 0.0769 0.0905 0.0547 0.0490 0.1177 0.0818 0.0902 0.0787 0.0785 0.2640
va: 2.1678 1.9987 3.8425 3.8740 3.9345 3.8964 3.8740 3.8476 3.8177 3.9595 4.1819 1.0196 1.0100 1.0168 1.0123 1.0083 1.0086 1.0077 1.0079 1.0146 1.0079 1.0077 1.0144 1.0065 1.0280 1.0030 1.0007 1.0009 0.9883
dispcorr: -0.012377969 hartree
energy: -504.361193608472
dipole: 8.47855 -8.75931 -0.28076 8.19561 -7.53445 0.66116 -0.08412 -0.81574 -0.89986
magnitude: 1.15140 au
magnitude: 2.92661 debye
