program: Orca
programVersion: 5.0.2
elementType: O O C C C C C C C C C H H H H H H H H H H H H H H H H H H
charge: 0
multiplicity: 1
keywords: wb97x-d3
keywords: def2-TZVPP
keywords: def2/J RIJCOSX
keywords: DEFGRID2
keywords: scfconv7
keywords: smallprint printgap noloewdin
keywords: NOSOSCF
formula: C9H18O2
InChI: InChI=1/C9H18O2/c1-2-3-4-5-6-7-8-9(10)11/h10H,2-8H2,1H3
29 atoms
O  -4.574081 -0.870498 0.428401
O  -2.94641 -2.316767 -0.045327
C  0.986339 -0.260894 0.742736
C  1.752738 0.874699 0.074218
C  -0.530207 -0.095568 0.733265
C  3.262796 0.714527 0.197591
C  -1.147576 -0.1332 -0.660433
C  4.049206 1.844294 -0.45415
C  -2.6644 -0.001606 -0.647648
C  5.554018 1.672952 -0.307765
C  -3.375385 -1.186354 -0.05867
H  1.249486 -1.209714 0.262751
H  1.321376 -0.345417 1.780982
H  1.485419 0.9394 -0.984986
H  1.450518 1.827328 0.523271
H  -0.968901 -0.885962 1.348518
H  -0.796606 0.84857 1.219708
H  3.534483 0.65093 1.256989
H  3.563716 -0.239228 -0.249493
H  -0.856166 -1.053932 -1.172671
H  -0.751357 0.685199 -1.263945
H  3.745258 2.798658 -0.013635
H  3.788676 1.903041 -1.5152
H  -3.038983 0.097519 -1.672358
H  -2.970697 0.907859 -0.128125
H  6.101293 2.487937 -0.783184
H  5.89258 0.740682 -0.763849
H  5.849254 1.649041 0.743036
H  -5.021762 -1.667117 0.753714
elementType: O C H
totalener: -504.35239562 hartree
nucrepener: 608.11753356 hartree
electener: -1112.46992918 hartree
oneelecener: -1889.34403863 hartree
twoeener: 776.87410945 hartree
cpcmener: -0.02089813 hartree
kineticenergy: 501.95204234 hartree
xcener: -49.762436641867 hartree
chargesum: -0.0000000
charge: -0.313874 -0.485640 -0.123544 -0.108459 -0.149584 -0.118258 -0.110529 -0.075458 -0.140366 -0.282980 0.415396 0.064133 0.071654 0.060762 0.058203 0.079157 0.067282 0.056004 0.057456 0.066013 0.081082 0.053802 0.053836 0.120303 0.093813 0.089769 0.077850 0.077664 0.264514
qa: -0.3139 -0.4856 -0.1235 -0.1085 -0.1496 -0.1183 -0.1105 -0.0755 -0.1404 -0.2830 0.4154 0.0641 0.0717 0.0608 0.0582 0.0792 0.0673 0.0560 0.0575 0.0660 0.0811 0.0538 0.0538 0.1203 0.0938 0.0898 0.0778 0.0777 0.2645
va: 2.1724 1.9929 3.8915 3.8706 3.8946 3.8869 3.8576 3.8725 3.8695 3.9470 4.1684 1.0094 1.0102 1.0095 1.0096 1.0209 1.0091 1.0092 1.0077 1.0246 1.0157 1.0071 1.0075 1.0081 1.0215 1.0043 1.0005 1.0006 0.9878
dispcorr: -0.009489975 hartree
energy: -504.361885591929
dipole: 22.20296 -22.64887 -0.44590 9.41760 -8.49045 0.92715 -0.70731 0.68450 -0.02282
magnitude: 1.02906 au
magnitude: 2.61565 debye
