program: Orca
programVersion: 5.0.2
elementType: O O C C C C C C C C C H H H H H H H H H H H H H H H H H H
charge: 0
multiplicity: 1
keywords: wb97x-d3
keywords: def2-TZVPP
keywords: def2/J RIJCOSX
keywords: DEFGRID2
keywords: scfconv7
keywords: smallprint printgap noloewdin
keywords: NOSOSCF
formula: C9H18O2
InChI: InChI=1/C9H18O2/c1-2-3-4-5-6-7-8-9(10)11/h10H,2-8H2,1H3
29 atoms
O  -4.390253 -2.005513 0.104014
O  -2.473076 -2.463625 -0.938643
C  0.533692 1.775067 0.028531
C  1.713567 0.870314 0.364508
C  -0.810963 1.27105 0.542559
C  3.05048 1.44891 -0.079667
C  -1.267224 -0.026117 -0.113509
C  4.236954 0.55234 0.249103
C  -2.653206 -0.43733 0.353953
C  5.565756 1.143042 -0.196678
C  -3.131315 -1.730473 -0.237626
H  0.721291 2.769035 0.446291
H  0.477109 1.910581 -1.05728
H  1.735443 0.693177 1.445773
H  1.578638 -0.111822 -0.099334
H  -0.756242 1.131645 1.627847
H  -1.568617 2.042608 0.375087
H  3.025581 1.633754 -1.159414
H  3.197134 2.428034 0.389802
H  -0.55537 -0.824707 0.10587
H  -1.267022 0.101524 -1.199991
H  4.09424 -0.424707 -0.222659
H  4.262316 0.36628 1.327218
H  -3.387834 0.339634 0.123077
H  -2.675322 -0.544526 1.443809
H  5.583168 1.309019 -1.275729
H  6.401953 0.486337 0.047238
H  5.753962 2.104896 0.284575
H  -4.66053 -2.852428 -0.283407
elementType: O C H
totalener: -504.35298973 hartree
nucrepener: 602.58143271 hartree
electener: -1106.93442243 hartree
oneelecener: -1878.21914179 hartree
twoeener: 771.28471936 hartree
cpcmener: -0.02105641 hartree
kineticenergy: 501.94888910 hartree
xcener: -49.761808092688 hartree
chargesum: -0.0000000
charge: -0.314392 -0.481910 -0.129147 -0.108713 -0.137984 -0.118283 -0.089090 -0.074789 -0.151780 -0.284004 0.428496 0.072170 0.062480 0.057753 0.060847 0.066278 0.075970 0.056807 0.056151 0.061234 0.068241 0.053980 0.053651 0.102592 0.105355 0.078056 0.090278 0.077699 0.262053
qa: -0.3144 -0.4819 -0.1291 -0.1087 -0.1380 -0.1183 -0.0891 -0.0748 -0.1518 -0.2840 0.4285 0.0722 0.0625 0.0578 0.0608 0.0663 0.0760 0.0568 0.0562 0.0612 0.0682 0.0540 0.0537 0.1026 0.1054 0.0781 0.0903 0.0777 0.2621
va: 2.1774 1.9998 3.8979 3.8715 3.9244 3.8872 3.8547 3.8708 3.8553 3.9475 4.1927 1.0110 1.0092 1.0098 1.0083 1.0087 1.0101 1.0077 1.0092 1.0219 1.0145 1.0073 1.0071 1.0177 1.0132 1.0004 1.0041 1.0007 0.9894
dispcorr: -0.009167646 hartree
energy: -504.362157371638
dipole: 20.57968 -21.19328 -0.61360 11.75729 -11.19905 0.55824 2.17075 -1.55967 0.61108
magnitude: 1.03032 au
magnitude: 2.61885 debye
