program: Orca
programVersion: 5.0.2
elementType: O O C C C C C C C C C H H H H H H H H H H H H H H H H H H
charge: 0
multiplicity: 1
keywords: wb97x-d3
keywords: def2-TZVPP
keywords: def2/J RIJCOSX
keywords: DEFGRID2
keywords: scfconv7
keywords: smallprint printgap noloewdin
keywords: NOSOSCF
formula: C9H18O2
InChI: InChI=1/C9H18O2/c1-2-3-4-5-6-7-8-9(10)11/h10H,2-8H2,1H3
29 atoms
O  -4.096455 -1.615885 -0.979555
O  -3.564365 -1.992507 1.153126
C  0.733043 0.486376 0.32602
C  2.028736 1.209203 -0.019954
C  -0.452149 0.974489 -0.497638
C  3.218781 0.718934 0.796075
C  -1.793679 0.381478 -0.082727
C  4.508121 1.49589 0.548368
C  -1.881103 -1.130781 -0.327758
C  5.059349 1.342339 -0.86215
C  -3.242119 -1.637226 0.041978
H  0.874246 -0.589919 0.184808
H  0.51303 0.626629 1.390284
H  2.231152 1.090937 -1.089115
H  1.897406 2.284469 0.146297
H  -0.519766 2.063002 -0.41002
H  -0.274915 0.76625 -1.557882
H  2.965987 0.779669 1.859407
H  3.390642 -0.343007 0.587318
H  -2.591364 0.880303 -0.63835
H  -1.973674 0.587733 0.975986
H  5.264974 1.16409 1.26411
H  4.337176 2.556022 0.760952
H  -1.145302 -1.657366 0.280178
H  -1.668146 -1.344355 -1.376532
H  4.38357 1.751927 -1.614113
H  5.2249 0.291112 -1.10764
H  6.014271 1.858297 -0.971894
H  -4.975606 -1.901431 -0.685309
elementType: O C H
totalener: -504.35066837 hartree
nucrepener: 605.34282985 hartree
electener: -1109.69349822 hartree
oneelecener: -1883.51140450 hartree
twoeener: 773.81790628 hartree
cpcmener: -0.02110580 hartree
kineticenergy: 501.94995974 hartree
xcener: -49.761725900406 hartree
chargesum: -0.0000000
charge: -0.307777 -0.486638 -0.116216 -0.127975 -0.119071 -0.107228 -0.160721 -0.111598 -0.100313 -0.278567 0.407024 0.062052 0.060820 0.063214 0.058941 0.072687 0.067353 0.066102 0.060920 0.095298 0.082014 0.068312 0.053676 0.091943 0.092448 0.080181 0.078977 0.091629 0.262514
qa: -0.3078 -0.4866 -0.1162 -0.1280 -0.1191 -0.1072 -0.1607 -0.1116 -0.1003 -0.2786 0.4070 0.0621 0.0608 0.0632 0.0589 0.0727 0.0674 0.0661 0.0609 0.0953 0.0820 0.0683 0.0537 0.0919 0.0924 0.0802 0.0790 0.0916 0.2625
va: 2.1724 1.9974 3.8833 3.8824 3.8913 3.8752 3.9097 3.8977 3.7963 3.9268 4.2002 1.0078 1.0098 1.0062 1.0096 1.0112 1.0091 1.0119 1.0090 1.0155 1.0147 1.0073 1.0086 1.0257 1.0224 0.9983 1.0007 1.0043 0.9889
dispcorr: -0.009514472 hartree
energy: -504.360182842583
dipole: 22.37475 -22.17075 0.20400 10.20867 -9.75991 0.44877 -1.85651 0.91345 -0.94306
magnitude: 1.06413 au
magnitude: 2.70481 debye
