program: Orca
programVersion: 5.0.2
elementType: O O C C C C C C C C C H H H H H H H H H H H H H H H H H H
charge: 0
multiplicity: 1
keywords: wb97x-d3
keywords: def2-TZVPP
keywords: def2/J RIJCOSX
keywords: DEFGRID2
keywords: scfconv7
keywords: smallprint printgap noloewdin
keywords: NOSOSCF
formula: C9H18O2
InChI: InChI=1/C9H18O2/c1-2-3-4-5-6-7-8-9(10)11/h10H,2-8H2,1H3
29 atoms
O  -4.046592 -2.599926 -0.192058
O  -4.202792 -0.474777 0.467183
C  0.711408 1.364788 0.010614
C  2.175264 1.460655 -0.409428
C  0.054336 0.02461 -0.295812
C  3.105111 0.520405 0.34914
C  -1.430105 0.014195 0.044592
C  4.571476 0.637939 -0.058731
C  -2.070554 -1.328028 -0.265314
C  5.201096 1.984965 0.267616
C  -3.535862 -1.392479 0.048403
H  0.627072 1.573934 1.08261
H  0.147843 2.155123 -0.495196
H  2.257332 1.259627 -1.483642
H  2.506275 2.493387 -0.269773
H  0.185903 -0.208567 -1.358161
H  0.554372 -0.776981 0.255708
H  3.013165 0.711628 1.424486
H  2.784427 -0.514027 0.197676
H  -1.934956 0.80529 -0.516214
H  -1.56026 0.251406 1.103982
H  4.665155 0.440119 -1.131119
H  5.140756 -0.149241 0.442941
H  -1.569353 -2.130666 0.284238
H  -1.944285 -1.577852 -1.323914
H  4.730055 2.80341 -0.277878
H  6.261545 1.996795 0.012143
H  5.118089 2.210128 1.3330
H  -4.994132 -2.606788 0.014653
elementType: O C H
totalener: -504.35171430 hartree
nucrepener: 602.48929139 hartree
electener: -1106.84100569 hartree
oneelecener: -1877.94302696 hartree
twoeener: 771.10202127 hartree
cpcmener: -0.02126419 hartree
kineticenergy: 501.94989207 hartree
xcener: -49.763199890668 hartree
chargesum: 0.0000000
charge: -0.314632 -0.481561 -0.129292 -0.141446 -0.119570 -0.113876 -0.101454 -0.115071 -0.135454 -0.276606 0.423284 0.063083 0.071202 0.061371 0.078959 0.063136 0.064832 0.060986 0.072530 0.063365 0.066395 0.054226 0.068281 0.101802 0.103967 0.079292 0.090879 0.079248 0.262122
qa: -0.3146 -0.4816 -0.1293 -0.1414 -0.1196 -0.1139 -0.1015 -0.1151 -0.1355 -0.2766 0.4233 0.0631 0.0712 0.0614 0.0790 0.0631 0.0648 0.0610 0.0725 0.0634 0.0664 0.0542 0.0683 0.1018 0.1040 0.0793 0.0909 0.0792 0.2621
va: 2.1774 2.0012 3.9029 3.8931 3.9060 3.8634 3.8951 3.9010 3.8376 3.9282 4.1979 1.0091 1.0097 1.0084 1.0093 1.0084 1.0079 1.0084 1.0125 1.0186 1.0156 1.0081 1.0060 1.0163 1.0145 0.9990 1.0046 1.0001 0.9895
dispcorr: -0.009384732 hartree
energy: -504.361099031582
dipole: 24.29259 -23.77341 0.51918 8.24785 -9.08624 -0.83839 -0.65483 0.28633 -0.36849
magnitude: 1.05273 au
magnitude: 2.67582 debye
