program: Orca
programVersion: 5.0.2
elementType: O O C C C C C C C C C H H H H H H H H H H H H H H H H H H
charge: 0
multiplicity: 1
keywords: wb97x-d3
keywords: def2-TZVPP
keywords: def2/J RIJCOSX
keywords: DEFGRID2
keywords: scfconv7
keywords: smallprint printgap noloewdin
keywords: NOSOSCF
formula: C9H18O2
InChI: InChI=1/C9H18O2/c1-2-3-4-5-6-7-8-9(10)11/h10H,2-8H2,1H3
29 atoms
O  -3.354963 -2.533594 -0.47804
O  -3.653585 -0.334464 -0.266297
C  0.327477 1.568576 -0.911594
C  1.503692 1.827672 0.025793
C  -0.342821 0.206163 -0.760533
C  2.656261 0.844196 -0.129821
C  -0.917221 -0.044401 0.628821
C  3.870969 1.216223 0.711236
C  -1.70603 -1.343421 0.723556
C  5.024798 0.237556 0.556112
C  -2.988399 -1.323995 -0.058936
H  -0.425428 2.348731 -0.761234
H  0.669361 1.678496 -1.945523
H  1.874909 2.840267 -0.161332
H  1.164938 1.827465 1.066979
H  -1.139692 0.137801 -1.507204
H  0.361443 -0.594369 -1.007627
H  2.328099 -0.164888 0.14167
H  2.949204 0.791173 -1.184839
H  -1.547156 0.797234 0.932105
H  -0.109452 -0.090598 1.361806
H  3.578578 1.273862 1.764339
H  4.205519 2.221586 0.437082
H  -1.986457 -1.535153 1.765162
H  -1.094398 -2.193555 0.416346
H  4.735841 -0.770274 0.861188
H  5.884337 0.528763 1.161825
H  5.360432 0.180901 -0.481516
H  -4.210758 -2.483176 -0.932182
elementType: O C H
totalener: -504.35149992 hartree
nucrepener: 621.66315860 hartree
electener: -1126.01465853 hartree
oneelecener: -1916.36529542 hartree
twoeener: 790.35063690 hartree
cpcmener: -0.02099957 hartree
kineticenergy: 501.94333008 hartree
xcener: -49.762194445074 hartree
chargesum: -0.0000000
charge: -0.312702 -0.487053 -0.158824 -0.130087 -0.147925 -0.115430 -0.117011 -0.082091 -0.130485 -0.277566 0.412637 0.074996 0.073600 0.074234 0.067596 0.083259 0.074745 0.057595 0.061650 0.068128 0.079953 0.055008 0.054046 0.119328 0.093136 0.077051 0.090067 0.077175 0.264970
qa: -0.3127 -0.4871 -0.1588 -0.1301 -0.1479 -0.1154 -0.1170 -0.0821 -0.1305 -0.2776 0.4126 0.0750 0.0736 0.0742 0.0676 0.0833 0.0747 0.0576 0.0617 0.0681 0.0800 0.0550 0.0540 0.1193 0.0931 0.0771 0.0901 0.0772 0.2650
va: 2.1734 1.9920 3.9185 3.8684 3.8591 3.8554 3.8590 3.8781 3.8670 3.9448 4.1701 1.0088 1.0075 1.0109 1.0026 1.0191 1.0016 1.0052 1.0091 1.0266 1.0116 1.0066 1.0082 1.0078 1.0220 1.0011 1.0042 1.0008 0.9875
dispcorr: -0.010109155 hartree
energy: -504.361609078209
dipole: 21.11167 -20.62755 0.48412 6.41086 -7.24837 -0.83751 1.85484 -1.67996 0.17488
magnitude: 0.98305 au
magnitude: 2.49871 debye
