program: Orca
programVersion: 5.0.2
elementType: O O C C C C C C C C C H H H H H H H H H H H H H H H H H H
charge: 0
multiplicity: 1
keywords: wb97x-d3
keywords: def2-TZVPP
keywords: def2/J RIJCOSX
keywords: DEFGRID2
keywords: scfconv7
keywords: smallprint printgap noloewdin
keywords: NOSOSCF
formula: C9H18O2
InChI: InChI=1/C9H18O2/c1-2-3-4-5-6-7-8-9(10)11/h10H,2-8H2,1H3
29 atoms
O  -2.790341 -2.413074 0.428585
O  -3.290149 -1.544148 -1.560517
C  0.718549 0.889538 0.299535
C  1.740786 1.106305 -0.810724
C  -0.65475 0.502077 -0.23516
C  3.116623 1.555694 -0.327355
C  -1.686787 0.301348 0.867678
C  3.866707 0.516365 0.497966
C  -3.073837 -0.079824 0.34117
C  5.269117 0.970439 0.873849
C  -3.073207 -1.396301 -0.382058
H  1.064474 0.110155 0.98551
H  0.632635 1.804759 0.896027
H  1.84684 0.183473 -1.391917
H  1.349529 1.856013 -1.506046
H  -1.010487 1.275868 -0.923952
H  -0.555694 -0.411982 -0.831138
H  3.726153 1.817766 -1.198443
H  3.013938 2.477572 0.256009
H  -1.792142 1.228181 1.437176
H  -1.337108 -0.452909 1.577159
H  3.926301 -0.418506 -0.068728
H  3.308648 0.283779 1.409083
H  -3.437935 0.685605 -0.344553
H  -3.778476 -0.138367 1.175095
H  5.874124 1.167161 -0.013644
H  5.790485 0.215868 1.464994
H  5.245399 1.889078 1.463678
H  -2.773585 -3.24329 -0.072234
elementType: O C H
totalener: -504.35912334 hartree
nucrepener: 612.96840080 hartree
electener: -1117.32752415 hartree
oneelecener: -1898.84926691 hartree
twoeener: 781.52174276 hartree
cpcmener: -0.01741851 hartree
kineticenergy: 501.94971455 hartree
xcener: -49.759851538692 hartree
chargesum: 0.0000000
charge: -0.300234 -0.451165 -0.119505 -0.115952 -0.120677 -0.136541 -0.122786 -0.076431 -0.120534 -0.283117 0.378484 0.062841 0.060593 0.061168 0.070545 0.064676 0.062503 0.070447 0.058715 0.079089 0.074147 0.054809 0.056158 0.081823 0.113398 0.077836 0.088827 0.077675 0.253206
qa: -0.3002 -0.4512 -0.1195 -0.1160 -0.1207 -0.1365 -0.1228 -0.0764 -0.1205 -0.2831 0.3785 0.0628 0.0606 0.0612 0.0705 0.0647 0.0625 0.0704 0.0587 0.0791 0.0741 0.0548 0.0562 0.0818 0.1134 0.0778 0.0888 0.0777 0.2532
va: 2.1582 2.0361 3.8772 3.8928 3.8849 3.9001 3.8785 3.8542 3.8469 3.9494 4.2120 1.0088 1.0098 1.0101 1.0110 1.0102 1.0170 1.0091 1.0084 1.0115 1.0204 1.0068 1.0076 1.0266 1.0136 1.0014 1.0038 1.0005 0.9965
dispcorr: -0.009661642 hartree
energy: -504.368784984621
dipole: 19.83521 -19.54238 0.29284 9.68255 -9.65421 0.02834 4.05735 -3.07030 0.98705
magnitude: 1.02997 au
magnitude: 2.61797 debye
