program: Orca
programVersion: 5.0.2
elementType: O O C C C C C C C C C H H H H H H H H H H H H H H H H H H
charge: 0
multiplicity: 1
keywords: wb97x-d3
keywords: def2-TZVPP
keywords: def2/J RIJCOSX
keywords: DEFGRID2
keywords: scfconv7
keywords: smallprint printgap noloewdin
keywords: NOSOSCF
formula: C9H18O2
InChI: InChI=1/C9H18O2/c1-2-3-4-5-6-7-8-9(10)11/h10H,2-8H2,1H3
29 atoms
O  -1.827843 -1.763092 1.141244
O  -1.2457 -2.247668 -0.95184
C  0.057793 0.999453 0.294228
C  1.277234 1.896263 0.109665
C  -1.252238 1.712426 -0.019081
C  2.602488 1.213865 0.4379
C  -2.5196 0.914816 0.276257
C  2.972165 0.072191 -0.502627
C  -2.687286 -0.361519 -0.552643
C  4.315614 -0.556478 -0.164196
C  -1.832597 -1.53765 -0.169832
H  0.162979 0.122525 -0.349223
H  0.039024 0.62835 1.325124
H  1.305241 2.266503 -0.921389
H  1.165693 2.781364 0.743771
H  -1.297772 2.641881 0.557358
H  -1.255236 2.013129 -1.072469
H  3.402562 1.960889 0.414113
H  2.57255 0.841178 1.46824
H  -3.381487 1.550531 0.062841
H  -2.580308 0.68605 1.343148
H  2.991531 0.446144 -1.531648
H  2.201144 -0.702737 -0.478447
H  -2.520616 -0.154219 -1.610631
H  -3.724349 -0.703982 -0.465809
H  4.56452 -1.365948 -0.852448
H  4.315904 -0.974801 0.844821
H  5.124568 0.175704 -0.214265
H  -1.284677 -2.541139 1.339168
elementType: O C H
totalener: -504.35703275 hartree
nucrepener: 641.29095877 hartree
electener: -1145.64799152 hartree
oneelecener: -1955.61314592 hartree
twoeener: 809.96515441 hartree
cpcmener: -0.01712711 hartree
kineticenergy: 501.94058048 hartree
xcener: -49.760254101589 hartree
chargesum: 0.0000000
charge: -0.293991 -0.451107 -0.113094 -0.134913 -0.127967 -0.126840 -0.128798 -0.078329 -0.120208 -0.284495 0.373799 0.059460 0.066967 0.061220 0.071610 0.069509 0.065934 0.071506 0.057770 0.088001 0.072846 0.055940 0.054099 0.082747 0.114799 0.089511 0.077386 0.078179 0.248458
qa: -0.2940 -0.4511 -0.1131 -0.1349 -0.1280 -0.1268 -0.1288 -0.0783 -0.1202 -0.2845 0.3738 0.0595 0.0670 0.0612 0.0716 0.0695 0.0659 0.0715 0.0578 0.0880 0.0728 0.0559 0.0541 0.0827 0.1148 0.0895 0.0774 0.0782 0.2485
va: 2.1660 2.0384 3.8382 3.9181 3.9009 3.8918 3.8868 3.8549 3.8160 3.9511 4.2169 1.0175 1.0116 1.0093 1.0114 1.0109 1.0090 1.0097 1.0087 1.0079 1.0214 1.0063 1.0094 1.0258 1.0068 1.0035 1.0007 1.0014 1.0007
dispcorr: -0.010724717 hartree
energy: -504.367757464324
dipole: 11.24460 -11.71819 -0.47358 9.24201 -8.65701 0.58500 0.55177 0.19568 0.74745
magnitude: 1.06075 au
magnitude: 2.69621 debye
