program: Orca
programVersion: 5.0.2
elementType: O O C C C C C C C C C H H H H H H H H H H H H H H H H H H
charge: 0
multiplicity: 1
keywords: wb97x-d3
keywords: def2-TZVPP
keywords: def2/J RIJCOSX
keywords: DEFGRID2
keywords: scfconv7
keywords: smallprint printgap noloewdin
keywords: NOSOSCF
formula: C9H18O2
InChI: InChI=1/C9H18O2/c1-2-3-4-5-6-7-8-9(10)11/h10H,2-8H2,1H3
29 atoms
O  -3.535285 -2.462326 -0.245481
O  -1.336472 -2.623689 0.078471
C  0.181144 2.455639 0.599562
C  1.4146 2.154678 -0.261725
C  -1.092498 1.714626 0.199725
C  2.323666 1.059266 0.287475
C  -1.005216 0.194404 0.245653
C  3.505841 0.757149 -0.624747
C  -2.345151 -0.442979 -0.081711
C  4.43627 -0.307925 -0.064379
C  -2.323725 -1.943939 -0.066013
H  0.409873 2.249177 1.650928
H  -0.037658 3.52613 0.550157
H  1.097995 1.89567 -1.278502
H  2.012262 3.065645 -0.364152
H  -1.90418 2.042981 0.857911
H  -1.381523 2.024077 -0.810869
H  2.695805 1.368616 1.27051
H  1.757094 0.139152 0.456762
H  -0.676649 -0.125887 1.238579
H  -0.252331 -0.1588 -0.462375
H  4.071275 1.677667 -0.801871
H  3.133699 0.437336 -1.603169
H  -2.688258 -0.12577 -1.072944
H  -3.117185 -0.101426 0.614818
H  4.855858 -0.004252 0.896608
H  5.271587 -0.503302 -0.738673
H  3.912419 -1.25309 0.090338
H  -3.485408 -3.430876 -0.249204
elementType: O C H
totalener: -504.35669447 hartree
nucrepener: 621.02369396 hartree
electener: -1125.38038843 hartree
oneelecener: -1915.14295055 hartree
twoeener: 789.76256211 hartree
cpcmener: -0.01730820 hartree
kineticenergy: 501.94835021 hartree
xcener: -49.760269366715 hartree
chargesum: -0.0000000
charge: -0.305108 -0.453579 -0.143472 -0.128543 -0.133547 -0.132215 -0.086767 -0.076961 -0.151075 -0.277275 0.405054 0.063035 0.082580 0.063033 0.078265 0.069430 0.065136 0.060333 0.065849 0.069519 0.059161 0.053832 0.053546 0.101628 0.100028 0.076758 0.089527 0.078084 0.253744
qa: -0.3051 -0.4536 -0.1435 -0.1285 -0.1335 -0.1322 -0.0868 -0.0770 -0.1511 -0.2773 0.4051 0.0630 0.0826 0.0630 0.0783 0.0694 0.0651 0.0603 0.0658 0.0695 0.0592 0.0538 0.0535 0.1016 0.1000 0.0768 0.0895 0.0781 0.2537
va: 2.1796 2.0352 3.9004 3.8550 3.9228 3.8709 3.8675 3.8730 3.8339 3.9468 4.2328 1.0092 1.0044 1.0065 1.0055 1.0104 1.0071 1.0097 1.0045 1.0119 1.0174 1.0078 1.0078 1.0144 1.0183 1.0013 1.0041 1.0011 0.9967
dispcorr: -0.009877744 hartree
energy: -504.366572213529
dipole: 14.73490 -15.56398 -0.82908 11.94605 -11.43244 0.51361 0.18625 -0.33624 -0.14999
magnitude: 0.98675 au
magnitude: 2.50811 debye
