program: Orca
programVersion: 5.0.2
elementType: O O C C C C C C C C C H H H H H H H H H H H H H H H H H H
charge: 0
multiplicity: 1
keywords: wb97x-d3
keywords: def2-TZVPP
keywords: def2/J RIJCOSX
keywords: DEFGRID2
keywords: scfconv7
keywords: smallprint printgap noloewdin
keywords: NOSOSCF
formula: C9H18O2
InChI: InChI=1/C9H18O2/c1-2-3-4-5-6-7-8-9(10)11/h10H,2-8H2,1H3
29 atoms
O  -2.137573 -2.933748 -0.352564
O  -3.74245 -1.527357 0.286844
C  0.277417 1.782844 0.44734
C  1.40927 1.117066 -0.330133
C  -1.061234 1.851553 -0.300248
C  2.709258 1.047207 0.461728
C  -2.059217 0.746094 0.036237
C  3.86021 0.424405 -0.318908
C  -1.574325 -0.652259 -0.310532
C  5.151989 0.356849 0.482651
C  -2.609606 -1.718332 -0.083715
H  0.136844 1.269705 1.405426
H  0.598721 2.796433 0.704188
H  1.120616 0.107468 -0.638011
H  1.579179 1.676329 -1.256605
H  -1.54924 2.802542 -0.074458
H  -0.880814 1.863778 -1.380553
H  2.993764 2.055813 0.781961
H  2.543373 0.474152 1.380742
H  -2.991217 0.947896 -0.497365
H  -2.299581 0.795025 1.101985
H  4.030001 0.998051 -1.235347
H  3.578026 -0.582921 -0.640611
H  -0.685542 -0.920845 0.267632
H  -1.267649 -0.704559 -1.360773
H  5.484179 1.351044 0.788215
H  5.959908 -0.093953 -0.095886
H  5.026882 -0.239215 1.388906
H  -2.829751 -3.597628 -0.210326
elementType: O C H
totalener: -504.35661002 hartree
nucrepener: 615.65983662 hartree
electener: -1120.01644665 hartree
oneelecener: -1904.12893045 hartree
twoeener: 784.11248381 hartree
cpcmener: -0.01745441 hartree
kineticenergy: 501.94124302 hartree
xcener: -49.758601809696 hartree
chargesum: 0.0000000
charge: -0.306704 -0.450889 -0.123801 -0.133200 -0.152931 -0.103951 -0.105888 -0.077832 -0.145612 -0.279165 0.401423 0.065304 0.078830 0.063441 0.060944 0.085391 0.065725 0.056202 0.055252 0.070113 0.068651 0.053236 0.054102 0.099697 0.105416 0.077016 0.089646 0.076832 0.252753
qa: -0.3067 -0.4509 -0.1238 -0.1332 -0.1529 -0.1040 -0.1059 -0.0778 -0.1456 -0.2792 0.4014 0.0653 0.0788 0.0634 0.0609 0.0854 0.0657 0.0562 0.0553 0.0701 0.0687 0.0532 0.0541 0.0997 0.1054 0.0770 0.0896 0.0768 0.2528
va: 2.1760 2.0404 3.8491 3.8832 3.9177 3.8729 3.9020 3.8755 3.8141 3.9482 4.2449 1.0066 1.0058 1.0072 1.0116 1.0036 1.0095 1.0097 1.0099 1.0213 1.0147 1.0075 1.0069 1.0153 1.0108 1.0010 1.0042 1.0009 0.9977
dispcorr: -0.009761647 hartree
energy: -504.366371668743
dipole: 19.19576 -18.32365 0.87211 10.33507 -10.53131 -0.19623 0.35939 -0.68542 -0.32603
magnitude: 0.95152 au
magnitude: 2.41856 debye
