program: Orca
programVersion: 5.0.2
elementType: O O C C C C C C C C C H H H H H H H H H H H H H H H H H H
charge: 0
multiplicity: 1
keywords: wb97x-d3
keywords: def2-TZVPP
keywords: def2/J RIJCOSX
keywords: DEFGRID2
keywords: scfconv7
keywords: smallprint printgap noloewdin
keywords: NOSOSCF
formula: C9H18O2
InChI: InChI=1/C9H18O2/c1-2-3-4-5-6-7-8-9(10)11/h10H,2-8H2,1H3
29 atoms
O  -2.518503 -1.912519 -1.293405
O  -2.099948 -2.55527 0.798285
C  0.148328 1.917148 -0.261499
C  1.581013 1.995418 0.25805
C  -0.658654 0.742349 0.2805
C  2.456446 0.80466 -0.115397
C  -2.110688 0.78054 -0.180259
C  3.900562 0.959479 0.346106
C  -2.969124 -0.344528 0.402442
C  4.769415 -0.236314 -0.013621
C  -2.485111 -1.714266 0.022584
H  -0.368531 2.847354 -0.004368
H  0.160869 1.872611 -1.356011
H  2.042624 2.908962 -0.130741
H  1.565921 2.10734 1.347801
H  -0.196242 -0.199343 -0.031659
H  -0.624827 0.74991 1.375654
H  2.044548 -0.113752 0.314383
H  2.436101 0.665962 -1.202554
H  -2.156744 0.758218 -1.272073
H  -2.562088 1.728781 0.122328
H  3.919603 1.110104 1.430137
H  4.327645 1.866777 -0.092636
H  -3.999504 -0.233543 0.053003
H  -2.984961 -0.281069 1.490624
H  4.805242 -0.391807 -1.093945
H  4.387459 -1.154897 0.43666
H  5.796202 -0.105555 0.332005
H  -2.188075 -2.799551 -1.503679
elementType: O C H
totalener: -504.35914558 hartree
nucrepener: 620.37470006 hartree
electener: -1124.73384564 hartree
oneelecener: -1913.69857218 hartree
twoeener: 788.96472654 hartree
cpcmener: -0.01731405 hartree
kineticenergy: 501.94946651 hartree
xcener: -49.759934000852 hartree
chargesum: -0.0000000
charge: -0.300662 -0.450695 -0.132985 -0.129406 -0.121570 -0.107340 -0.130454 -0.086114 -0.122080 -0.275946 0.379231 0.072802 0.065045 0.069885 0.062034 0.071124 0.067183 0.057176 0.057495 0.075869 0.078880 0.054235 0.053769 0.113350 0.083015 0.077159 0.076675 0.089445 0.252880
qa: -0.3007 -0.4507 -0.1330 -0.1294 -0.1216 -0.1073 -0.1305 -0.0861 -0.1221 -0.2759 0.3792 0.0728 0.0650 0.0699 0.0620 0.0711 0.0672 0.0572 0.0575 0.0759 0.0789 0.0542 0.0538 0.1134 0.0830 0.0772 0.0767 0.0894 0.2529
va: 2.1558 2.0367 3.8992 3.8997 3.8615 3.8628 3.8811 3.8870 3.8492 3.9454 4.2088 1.0114 1.0084 1.0112 1.0090 1.0145 1.0087 1.0079 1.0076 1.0185 1.0125 1.0064 1.0079 1.0127 1.0259 1.0008 1.0015 1.0043 0.9970
dispcorr: -0.009778873 hartree
energy: -504.368924453562
dipole: 15.50625 -15.72872 -0.22247 10.69199 -9.97786 0.71413 0.06922 -0.80552 -0.73630
magnitude: 1.04958 au
magnitude: 2.66782 debye
