program: Orca
programVersion: 5.0.2
elementType: O O C C C C C C C C C H H H H H H H H H H H H H H H H H H
charge: 0
multiplicity: 1
keywords: wb97x-d3
keywords: def2-TZVPP
keywords: def2/J RIJCOSX
keywords: DEFGRID2
keywords: scfconv7
keywords: smallprint printgap noloewdin
keywords: NOSOSCF
formula: C9H18O2
InChI: InChI=1/C9H18O2/c1-2-3-4-5-6-7-8-9(10)11/h10H,2-8H2,1H3
29 atoms
O  -2.775116 -2.827766 0.246329
O  -4.276326 -1.19524 0.020193
C  0.831177 1.324737 0.666952
C  1.891254 2.254895 0.082767
C  -0.045329 0.643801 -0.377178
C  2.90089 1.585802 -0.848245
C  -1.17379 -0.162637 0.249146
C  3.69301 0.437538 -0.227794
C  -2.043524 -0.855341 -0.806174
C  4.527939 0.84571 0.977477
C  -3.159977 -1.620126 -0.158332
H  1.303688 0.563122 1.296092
H  0.192378 1.907549 1.338455
H  1.391244 3.058217 -0.468179
H  2.419743 2.74717 0.904574
H  -0.468535 1.40065 -1.046884
H  0.559455 -0.01716 -1.005816
H  2.388816 1.220896 -1.743556
H  3.6030 2.348459 -1.200952
H  -1.800304 0.495688 0.857876
H  -0.753851 -0.911422 0.926864
H  4.352099 0.018078 -0.993182
H  3.01645 -0.374526 0.055697
H  -1.426929 -1.529008 -1.404908
H  -2.477547 -0.11122 -1.475292
H  5.142581 0.01634 1.331405
H  3.909693 1.167927 1.816998
H  5.201428 1.670013 0.731595
H  -3.504476 -3.27536 0.702978
elementType: O C H
totalener: -504.35705010 hartree
nucrepener: 616.69271195 hartree
electener: -1121.04976206 hartree
oneelecener: -1906.12415586 hartree
twoeener: 785.07439380 hartree
cpcmener: -0.01733059 hartree
kineticenergy: 501.94948871 hartree
xcener: -49.761819797650 hartree
chargesum: -0.0000000
charge: -0.299765 -0.455938 -0.118976 -0.168798 -0.129017 -0.149664 -0.141318 -0.107676 -0.089343 -0.275450 0.380780 0.067843 0.076029 0.074571 0.081377 0.067810 0.063757 0.075483 0.077254 0.079877 0.080175 0.070808 0.057528 0.092531 0.086828 0.092062 0.077619 0.080968 0.252645
qa: -0.2998 -0.4559 -0.1190 -0.1688 -0.1290 -0.1497 -0.1413 -0.1077 -0.0893 -0.2755 0.3808 0.0678 0.0760 0.0746 0.0814 0.0678 0.0638 0.0755 0.0773 0.0799 0.0802 0.0708 0.0575 0.0925 0.0868 0.0921 0.0776 0.0810 0.2526
va: 2.1679 2.0351 3.8640 3.9033 3.8705 3.8799 3.8869 3.8776 3.8159 3.9339 4.2257 1.0025 1.0109 1.0101 1.0011 1.0103 1.0075 1.0040 1.0076 1.0162 1.0180 1.0076 1.0033 1.0216 1.0250 1.0049 0.9988 1.0014 0.9974
dispcorr: -0.010196553 hartree
energy: -504.367246655736
dipole: 21.56685 -20.59336 0.97349 9.73428 -10.10575 -0.37147 0.63283 -0.64894 -0.01611
magnitude: 1.04208 au
magnitude: 2.64876 debye
