program: Orca
programVersion: 5.0.2
elementType: O O C C C C C C C C C H H H H H H H H H H H H H H H H H H
charge: 0
multiplicity: 1
keywords: wb97x-d3
keywords: def2-TZVPP
keywords: def2/J RIJCOSX
keywords: DEFGRID2
keywords: scfconv7
keywords: smallprint printgap noloewdin
keywords: NOSOSCF
formula: C9H18O2
InChI: InChI=1/C9H18O2/c1-2-3-4-5-6-7-8-9(10)11/h10H,2-8H2,1H3
29 atoms
O  -4.426492 -2.321586 0.212719
O  -4.263643 -0.143231 -0.220299
C  0.907642 0.808515 -0.236584
C  2.406906 0.561074 -0.127205
C  0.068849 -0.441319 -0.001687
C  3.235924 1.817371 -0.369733
C  -1.426563 -0.175305 -0.118391
C  4.744584 1.586753 -0.355047
C  -2.253359 -1.428848 0.115072
C  5.292625 1.169356 1.002491
C  -3.734425 -1.20255 0.011583
H  0.613574 1.581114 0.482504
H  0.67852 1.215989 -1.227504
H  2.630213 0.148686 0.861904
H  2.701303 -0.20851 -0.850075
H  0.360697 -1.21524 -0.720074
H  0.29245 -0.848936 0.990303
H  2.951915 2.246349 -1.336262
H  2.97885 2.573258 0.381254
H  -1.644921 0.23121 -1.109818
H  -1.713546 0.59572 0.601904
H  5.246732 2.504686 -0.673537
H  5.002318 0.829203 -1.10242
H  -2.044678 -1.851555 1.103513
H  -1.979177 -2.212187 -0.599027
H  6.380271 1.081899 0.979707
H  4.899989 0.204939 1.328389
H  5.041023 1.902989 1.771962
H  -5.37628 -2.139896 0.141042
elementType: O C H
totalener: -504.36040395 hartree
nucrepener: 596.12401342 hartree
electener: -1100.48441737 hartree
oneelecener: -1865.21684403 hartree
twoeener: 764.73242666 hartree
cpcmener: -0.01738502 hartree
kineticenergy: 501.94663572 hartree
xcener: -49.759586684274 hartree
chargesum: 0.0000000
charge: -0.306170 -0.452454 -0.114971 -0.118653 -0.114682 -0.111105 -0.091271 -0.111011 -0.140444 -0.274900 0.399794 0.058830 0.059003 0.061735 0.056941 0.060882 0.061646 0.066721 0.060261 0.064321 0.063338 0.069210 0.052506 0.100355 0.100186 0.090541 0.078625 0.077935 0.252831
qa: -0.3062 -0.4525 -0.1150 -0.1187 -0.1147 -0.1111 -0.0913 -0.1110 -0.1404 -0.2749 0.3998 0.0588 0.0590 0.0617 0.0569 0.0609 0.0616 0.0667 0.0603 0.0643 0.0633 0.0692 0.0525 0.1004 0.1002 0.0905 0.0786 0.0779 0.2528
va: 2.1805 2.0364 3.8916 3.8782 3.9115 3.8803 3.8866 3.8990 3.8341 3.9275 4.2326 1.0095 1.0109 1.0074 1.0089 1.0093 1.0095 1.0114 1.0086 1.0172 1.0176 1.0069 1.0088 1.0160 1.0160 1.0046 0.9990 1.0009 0.9977
dispcorr: -0.009087322 hartree
energy: -504.369491276264
dipole: 25.30478 -24.92996 0.37482 6.23250 -7.08259 -0.85009 0.96508 -0.80318 0.16190
magnitude: 0.94306 au
magnitude: 2.39706 debye
