program: Orca
programVersion: 5.0.2
elementType: O O C C C C C C C C C H H H H H H H H H H H H H H H H H H
charge: 0
multiplicity: 1
keywords: wb97x-d3
keywords: def2-TZVPP
keywords: def2/J RIJCOSX
keywords: DEFGRID2
keywords: scfconv7
keywords: smallprint printgap noloewdin
keywords: NOSOSCF
formula: C9H18O2
InChI: InChI=1/C9H18O2/c1-2-3-4-5-6-7-8-9(10)11/h10H,2-8H2,1H3
29 atoms
O  -3.875212 -1.732375 -0.063746
O  -1.927055 -2.687581 -0.569913
C  0.328498 1.600648 0.813874
C  1.509879 0.992631 0.066678
C  -0.940127 1.734491 -0.02342
C  2.791776 0.999664 0.891976
C  -1.505535 0.428593 -0.572641
C  3.98085 0.327899 0.211749
C  -1.91772 -0.554909 0.529319
C  4.468021 1.048414 -1.037692
C  -2.546149 -1.774653 -0.077359
H  0.125905 1.014157 1.716396
H  0.607975 2.597507 1.169972
H  1.280854 -0.038786 -0.222686
H  1.661194 1.542844 -0.867832
H  -1.712188 2.230926 0.572753
H  -0.738105 2.400162 -0.868446
H  3.056772 2.033249 1.143053
H  2.599184 0.498724 1.846451
H  -0.781967 -0.052533 -1.235166
H  -2.37782 0.660333 -1.189761
H  3.71767 -0.704596 -0.040559
H  4.805904 0.261282 0.92656
H  -2.609789 -0.068588 1.219123
H  -1.043029 -0.872148 1.099484
H  4.728589 2.086442 -0.818203
H  3.715986 1.059358 -1.828088
H  5.358277 0.5686 -1.447963
H  -4.236349 -2.516623 -0.505987
elementType: O C H
totalener: -504.35699570 hartree
nucrepener: 621.58004095 hartree
electener: -1125.93703664 hartree
oneelecener: -1916.03711527 hartree
twoeener: 790.10007862 hartree
cpcmener: -0.01735941 hartree
kineticenergy: 501.94781757 hartree
xcener: -49.760837418277 hartree
chargesum: -0.0000000
charge: -0.298609 -0.460458 -0.138456 -0.123222 -0.155893 -0.115350 -0.157893 -0.104284 -0.107169 -0.276195 0.388624 0.068351 0.075479 0.060012 0.067323 0.079256 0.075194 0.060887 0.067841 0.086693 0.098630 0.052347 0.068684 0.091465 0.094823 0.078298 0.079481 0.090496 0.253647
qa: -0.2986 -0.4605 -0.1385 -0.1232 -0.1559 -0.1153 -0.1579 -0.1043 -0.1072 -0.2762 0.3886 0.0684 0.0755 0.0600 0.0673 0.0793 0.0752 0.0609 0.0678 0.0867 0.0986 0.0523 0.0687 0.0915 0.0948 0.0783 0.0795 0.0905 0.2536
va: 2.1750 2.0306 3.8776 3.8468 3.9203 3.8820 3.8843 3.8957 3.7981 3.9284 4.2258 1.0031 1.0105 1.0078 1.0072 1.0074 1.0091 1.0096 1.0110 1.0096 1.0130 1.0095 1.0071 1.0244 1.0184 1.0007 0.9989 1.0046 0.9965
dispcorr: -0.010122054 hartree
energy: -504.367117751469
dipole: 16.99596 -17.53235 -0.53639 11.87401 -11.09761 0.77640 0.59964 -0.30502 0.29462
magnitude: 0.98859 au
magnitude: 2.51281 debye
