program: Orca
programVersion: 5.0.2
elementType: O O C C C C C C C C C H H H H H H H H H H H H H H H H H H
charge: 0
multiplicity: 1
keywords: wb97x-d3
keywords: def2-TZVPP
keywords: def2/J RIJCOSX
keywords: DEFGRID2
keywords: scfconv7
keywords: smallprint printgap noloewdin
keywords: NOSOSCF
formula: C9H18O2
InChI: InChI=1/C9H18O2/c1-2-3-4-5-6-7-8-9(10)11/h10H,2-8H2,1H3
29 atoms
O  -1.233038 -2.078179 0.781177
O  -2.026654 -2.275674 -1.290857
C  0.273557 2.241202 -0.31064
C  1.143435 1.991183 0.921366
C  -0.673036 1.100207 -0.672554
C  1.978161 0.713488 0.87727
C  -1.683703 0.768256 0.418795
C  2.96246 0.643305 -0.284058
C  -2.645691 -0.353838 0.024205
C  3.838121 -0.600059 -0.237992
C  -1.953108 -1.657001 -0.256766
H  -0.310586 3.152363 -0.14569
H  0.910996 2.45333 -1.173684
H  1.811922 2.848355 1.052028
H  0.515594 1.97111 1.817076
H  -1.214629 1.368472 -1.58501
H  -0.088738 0.209915 -0.929478
H  2.534799 0.631677 1.816749
H  1.32136 -0.163238 0.849885
H  -2.279238 1.657489 0.642408
H  -1.177777 0.504593 1.349828
H  3.595683 1.536713 -0.276444
H  2.42308 0.665213 -1.235421
H  -3.213875 -0.07432 -0.863492
H  -3.365991 -0.519741 0.830811
H  3.237021 -1.510983 -0.278373
H  4.428943 -0.638242 0.679713
H  4.535362 -0.631719 -1.077078
H  -0.794074 -2.914804 0.563256
elementType: O C H
totalener: -504.35708519 hartree
nucrepener: 648.80870151 hartree
electener: -1153.16578670 hartree
oneelecener: -1970.44957757 hartree
twoeener: 817.28379086 hartree
cpcmener: -0.01732624 hartree
kineticenergy: 501.94422811 hartree
xcener: -49.762172476182 hartree
chargesum: 0.0000000
charge: -0.297130 -0.449995 -0.165192 -0.154956 -0.120300 -0.116126 -0.141905 -0.090669 -0.122236 -0.277977 0.382828 0.076771 0.080941 0.075612 0.077299 0.083365 0.065168 0.075134 0.049750 0.084325 0.077952 0.059884 0.056578 0.081293 0.113595 0.077658 0.076917 0.089887 0.251528
qa: -0.2971 -0.4500 -0.1652 -0.1550 -0.1203 -0.1161 -0.1419 -0.0907 -0.1222 -0.2780 0.3828 0.0768 0.0809 0.0756 0.0773 0.0834 0.0652 0.0751 0.0498 0.0843 0.0780 0.0599 0.0566 0.0813 0.1136 0.0777 0.0769 0.0899 0.2515
va: 2.1563 2.0395 3.9008 3.8906 3.8501 3.8619 3.8648 3.8581 3.8497 3.9473 4.2010 1.0098 1.0007 1.0087 1.0028 1.0115 1.0116 1.0094 1.0131 1.0129 1.0170 1.0079 1.0047 1.0275 1.0110 1.0007 1.0018 1.0037 0.9983
dispcorr: -0.011327108 hartree
energy: -504.368412298358
dipole: 12.05389 -11.86952 0.18437 9.91665 -9.38314 0.53351 1.93998 -1.04712 0.89285
magnitude: 1.05632 au
magnitude: 2.68496 debye
