program: Orca
programVersion: 5.0.2
elementType: O O C C C C C C C C C H H H H H H H H H H H H H H H H H H
charge: 0
multiplicity: 1
keywords: wb97x-d3
keywords: def2-TZVPP
keywords: def2/J RIJCOSX
keywords: DEFGRID2
keywords: scfconv7
keywords: smallprint printgap noloewdin
keywords: NOSOSCF
formula: C9H18O2
InChI: InChI=1/C9H18O2/c1-2-3-4-5-6-7-8-9(10)11/h10H,2-8H2,1H3
29 atoms
O  -0.945339 -2.19458 -0.299749
O  -2.776378 -1.997377 0.95401
C  0.074241 2.314831 0.402817
C  1.442251 1.814674 -0.058417
C  -1.021756 1.253111 0.445336
C  1.997906 0.672579 0.785937
C  -1.304639 0.609702 -0.906294
C  3.438616 0.297123 0.449769
C  -2.416261 -0.438633 -0.847463
C  3.618524 -0.272636 -0.950624
C  -2.091109 -1.606862 0.039962
H  0.174782 2.750146 1.402098
H  -0.244945 3.132792 -0.251152
H  1.391097 1.513949 -1.108766
H  2.14532 2.65388 -0.026407
H  -0.756181 0.485968 1.180128
H  -1.94281 1.711708 0.818364
H  1.941967 0.954227 1.843038
H  1.36723 -0.216552 0.677138
H  -0.399066 0.159305 -1.318207
H  -1.607882 1.381628 -1.618583
H  3.79065 -0.437867 1.179169
H  4.081393 1.17476 0.573651
H  -2.608424 -0.824448 -1.853453
H  -3.344937 0.008135 -0.491255
H  4.648178 -0.593647 -1.117173
H  3.379867 0.456523 -1.726284
H  2.975637 -1.141676 -1.108617
H  -0.76791 -2.942465 0.291368
elementType: O C H
totalener: -504.35698207 hartree
nucrepener: 646.48406201 hartree
electener: -1150.84104409 hartree
oneelecener: -1965.81290600 hartree
twoeener: 814.97186191 hartree
cpcmener: -0.01728684 hartree
kineticenergy: 501.94594710 hartree
xcener: -49.762165580362 hartree
chargesum: 0.0000000
charge: -0.295514 -0.449898 -0.163585 -0.130825 -0.131121 -0.115157 -0.132263 -0.112279 -0.121955 -0.273079 0.380779 0.074240 0.074258 0.067868 0.075707 0.070340 0.082705 0.074083 0.050837 0.074115 0.084764 0.067438 0.054028 0.113340 0.081019 0.091654 0.079861 0.077489 0.251149
qa: -0.2955 -0.4499 -0.1636 -0.1308 -0.1311 -0.1152 -0.1323 -0.1123 -0.1220 -0.2731 0.3808 0.0742 0.0743 0.0679 0.0757 0.0703 0.0827 0.0741 0.0508 0.0741 0.0848 0.0674 0.0540 0.1133 0.0810 0.0917 0.0799 0.0775 0.2511
va: 2.1579 2.0403 3.9257 3.8472 3.8562 3.8629 3.8619 3.9019 3.8506 3.9266 4.2047 1.0079 1.0086 1.0004 1.0109 1.0086 1.0123 1.0118 1.0157 1.0162 1.0124 1.0065 1.0095 1.0105 1.0277 1.0051 0.9987 1.0021 0.9982
dispcorr: -0.011219292 hartree
energy: -504.368201365427
dipole: 13.32286 -12.61680 0.70606 9.63703 -9.32490 0.31213 -2.49359 1.79466 -0.69893
magnitude: 1.04137 au
magnitude: 2.64695 debye
