program: Orca
programVersion: 5.0.2
elementType: O O C C C C C C C C C H H H H H H H H H H H H H H H H H H
charge: 0
multiplicity: 1
keywords: wb97x-d3
keywords: def2-TZVPP
keywords: def2/J RIJCOSX
keywords: DEFGRID2
keywords: scfconv7
keywords: smallprint printgap noloewdin
keywords: NOSOSCF
formula: C9H18O2
InChI: InChI=1/C9H18O2/c1-2-3-4-5-6-7-8-9(10)11/h10H,2-8H2,1H3
29 atoms
O  -3.077251 -2.845246 -0.217881
O  -4.25825 -1.217385 0.742476
C  1.008472 0.889187 0.236852
C  1.968439 1.85606 -0.446188
C  -0.241473 0.605624 -0.58677
C  3.167166 2.252297 0.412378
C  -1.190979 -0.362662 0.105068
C  4.09382 1.105365 0.809555
C  -2.449986 -0.63268 -0.726985
C  4.739761 0.399384 -0.373464
C  -3.371643 -1.566349 0.000696
H  1.515474 -0.057414 0.449412
H  0.71489 1.300379 1.209298
H  2.310136 1.423806 -1.392417
H  1.421924 2.765269 -0.716732
H  -0.765968 1.545089 -0.790892
H  0.045905 0.197465 -1.56159
H  3.752849 3.005817 -0.124519
H  2.80314 2.74562 1.319599
H  -1.481994 0.044296 1.077774
H  -0.672055 -1.305008 0.302011
H  3.552708 0.375885 1.419212
H  4.878925 1.505626 1.457379
H  -2.170201 -1.054507 -1.694308
H  -2.979879 0.303629 -0.907726
H  5.464552 -0.345588 -0.04082
H  5.269626 1.107024 -1.015341
H  4.007564 -0.1199 -0.993927
H  -3.659268 -3.415562 0.308167
elementType: O C H
totalener: -504.35803061 hartree
nucrepener: 606.99525805 hartree
electener: -1111.35328867 hartree
oneelecener: -1886.77030776 hartree
twoeener: 775.41701909 hartree
cpcmener: -0.01731050 hartree
kineticenergy: 501.95101254 hartree
xcener: -49.760557902779 hartree
chargesum: -0.0000000
charge: -0.300192 -0.456484 -0.114905 -0.135373 -0.123656 -0.146550 -0.135035 -0.116862 -0.095583 -0.273913 0.383818 0.061729 0.063184 0.068326 0.074337 0.063842 0.064492 0.075060 0.068881 0.079344 0.079369 0.061265 0.070980 0.092142 0.088243 0.091191 0.081128 0.078419 0.252803
qa: -0.3002 -0.4565 -0.1149 -0.1354 -0.1237 -0.1465 -0.1350 -0.1169 -0.0956 -0.2739 0.3838 0.0617 0.0632 0.0683 0.0743 0.0638 0.0645 0.0751 0.0689 0.0793 0.0794 0.0613 0.0710 0.0921 0.0882 0.0912 0.0811 0.0784 0.2528
va: 2.1696 2.0349 3.8666 3.8767 3.8950 3.9016 3.8868 3.8768 3.8252 3.9289 4.2248 1.0078 1.0096 1.0020 1.0116 1.0108 1.0094 1.0074 1.0103 1.0156 1.0176 1.0025 1.0075 1.0216 1.0239 1.0048 1.0010 0.9975 0.9973
dispcorr: -0.009666694 hartree
energy: -504.367697308145
dipole: 22.45751 -21.62224 0.83527 9.37338 -9.71251 -0.33912 -1.56697 1.09692 -0.47005
magnitude: 1.01668 au
magnitude: 2.58418 debye
