program: Orca
programVersion: 5.0.2
elementType: O O C C C C C C C C C H H H H H H H H H H H H H H H H H H
charge: 0
multiplicity: 1
keywords: wb97x-d3
keywords: def2-TZVPP
keywords: def2/J RIJCOSX
keywords: DEFGRID2
keywords: scfconv7
keywords: smallprint printgap noloewdin
keywords: NOSOSCF
formula: C9H18O2
InChI: InChI=1/C9H18O2/c1-2-3-4-5-6-7-8-9(10)11/h10H,2-8H2,1H3
29 atoms
O  -4.555969 -0.894675 0.46535
O  -2.9418 -2.328236 -0.082216
C  0.979167 -0.250464 0.735942
C  1.754445 0.880528 0.068728
C  -0.537501 -0.080214 0.723967
C  3.26389 0.714908 0.200359
C  -1.159404 -0.120538 -0.667781
C  4.059901 1.838774 -0.451047
C  -2.67795 -0.004496 -0.647412
C  5.563594 1.663193 -0.300197
C  -3.372416 -1.200641 -0.058144
H  1.23985 -1.201764 0.259302
H  1.309625 -0.334659 1.776124
H  1.492866 0.944101 -0.992244
H  1.45463 1.835734 0.514547
H  -0.977473 -0.867836 1.342767
H  -0.800592 0.86674 1.207931
H  3.529464 0.654541 1.26175
H  3.563531 -0.242104 -0.241083
H  -0.863081 -1.037236 -1.18389
H  -0.77445 0.704538 -1.270576
H  3.759719 2.796404 -0.014177
H  3.804379 1.89649 -1.513706
H  -3.05716 0.091414 -1.671375
H  -2.991915 0.902002 -0.126393
H  6.113055 2.476698 -0.776625
H  5.902563 0.729797 -0.754124
H  5.857985 1.64166 0.751083
H  -4.994312 -1.698317 0.786904
elementType: O C H
totalener: -504.35977075 hartree
nucrepener: 607.88964584 hartree
electener: -1112.24941660 hartree
oneelecener: -1888.85414489 hartree
twoeener: 776.60472829 hartree
cpcmener: -0.01714442 hartree
kineticenergy: 501.94776971 hartree
xcener: -49.759730463503 hartree
chargesum: 0.0000000
charge: -0.305450 -0.457388 -0.123790 -0.107813 -0.148523 -0.117291 -0.108871 -0.075831 -0.138011 -0.280298 0.391151 0.064582 0.071053 0.059916 0.057471 0.079867 0.065980 0.055578 0.057199 0.066860 0.079336 0.053479 0.053447 0.116716 0.091213 0.089149 0.077388 0.077170 0.255708
qa: -0.3055 -0.4574 -0.1238 -0.1078 -0.1485 -0.1173 -0.1089 -0.0758 -0.1380 -0.2803 0.3912 0.0646 0.0711 0.0599 0.0575 0.0799 0.0660 0.0556 0.0572 0.0669 0.0793 0.0535 0.0534 0.1167 0.0912 0.0891 0.0774 0.0772 0.2557
va: 2.1743 2.0280 3.8945 3.8707 3.8969 3.8887 3.8621 3.8742 3.8629 3.9480 4.2020 1.0095 1.0102 1.0096 1.0097 1.0200 1.0090 1.0094 1.0079 1.0249 1.0149 1.0070 1.0074 1.0085 1.0217 1.0044 1.0008 1.0009 0.9959
dispcorr: -0.009490870 hartree
energy: -504.369261622884
dipole: 22.17476 -22.59307 -0.41831 9.48182 -8.62381 0.85801 -0.67630 0.68905 0.01275
magnitude: 0.95463 au
magnitude: 2.42649 debye
