program: Orca
programVersion: 5.0.2
elementType: O O C C C C C C C C C H H H H H H H H H H H H H H H H H H
charge: 0
multiplicity: 1
keywords: wb97x-d3
keywords: def2-TZVPP
keywords: def2/J RIJCOSX
keywords: DEFGRID2
keywords: scfconv7
keywords: smallprint printgap noloewdin
keywords: NOSOSCF
formula: C9H18O2
InChI: InChI=1/C9H18O2/c1-2-3-4-5-6-7-8-9(10)11/h10H,2-8H2,1H3
29 atoms
O  -3.648443 -0.905349 1.037796
O  -4.008659 -0.578549 -1.135861
C  0.529114 1.203716 0.227437
C  1.91585 0.582601 0.095578
C  -0.59336 0.408662 -0.434312
C  3.003511 1.461348 0.704059
C  -0.823017 -0.966741 0.182521
C  4.40459 0.857739 0.661404
C  -2.004826 -1.719498 -0.436479
C  4.959211 0.672567 -0.744229
C  -3.316755 -1.012257 -0.246766
H  0.293128 1.345074 1.28795
H  0.549981 2.206317 -0.211324
H  1.938955 -0.39712 0.58357
H  2.12522 0.401053 -0.963604
H  -1.512787 0.999512 -0.370725
H  -0.381522 0.294731 -1.502827
H  3.013554 2.4315 0.194665
H  2.742111 1.67194 1.746173
H  -0.965399 -0.872065 1.262302
H  0.063078 -1.589727 0.046938
H  4.40207 -0.104348 1.183605
H  5.082276 1.504078 1.226249
H  -2.079411 -2.712846 0.014625
H  -1.844496 -1.857354 -1.505997
H  4.377746 -0.043634 -1.326587
H  5.986595 0.305616 -0.716986
H  4.96491 1.616293 -1.294242
H  -4.490376 -0.432691 1.125989
elementType: O C H
totalener: -504.35793559 hartree
nucrepener: 615.83347521 hartree
electener: -1120.19141080 hartree
oneelecener: -1904.53325708 hartree
twoeener: 784.34184628 hartree
cpcmener: -0.01736386 hartree
kineticenergy: 501.94635948 hartree
xcener: -49.760279173784 hartree
chargesum: -0.0000000
charge: -0.300474 -0.450883 -0.136135 -0.120524 -0.129330 -0.117648 -0.129237 -0.106623 -0.124081 -0.275737 0.378312 0.064335 0.072174 0.061805 0.064073 0.077006 0.067490 0.061879 0.066772 0.076553 0.082184 0.052707 0.068455 0.112896 0.082662 0.079125 0.090196 0.078862 0.253186
qa: -0.3005 -0.4509 -0.1361 -0.1205 -0.1293 -0.1176 -0.1292 -0.1066 -0.1241 -0.2757 0.3783 0.0643 0.0722 0.0618 0.0641 0.0770 0.0675 0.0619 0.0668 0.0766 0.0822 0.0527 0.0685 0.1129 0.0827 0.0791 0.0902 0.0789 0.2532
va: 2.1567 2.0361 3.9069 3.8542 3.8927 3.8857 3.8651 3.8976 3.8490 3.9285 4.2135 1.0099 1.0095 1.0067 1.0066 1.0195 1.0095 1.0093 1.0110 1.0193 1.0112 1.0093 1.0070 1.0123 1.0260 0.9988 1.0047 1.0008 0.9967
dispcorr: -0.009948222 hartree
energy: -504.367883807321
dipole: 22.76612 -22.18131 0.58480 4.56329 -4.80938 -0.24609 0.80198 0.05985 0.86184
magnitude: 1.07020 au
magnitude: 2.72022 debye
