program: Orca
programVersion: 5.0.2
elementType: O O C C C C C C C C C H H H H H H H H H H H H H H H H H H
charge: 0
multiplicity: 1
keywords: wb97x-d3
keywords: def2-TZVPP
keywords: def2/J RIJCOSX
keywords: DEFGRID2
keywords: scfconv7
keywords: smallprint printgap noloewdin
keywords: NOSOSCF
formula: C9H18O2
InChI: InChI=1/C9H18O2/c1-2-3-4-5-6-7-8-9(10)11/h10H,2-8H2,1H3
29 atoms
O  -4.388793 -2.007084 0.106922
O  -2.477546 -2.460757 -0.943502
C  0.533382 1.774913 0.028955
C  1.714357 0.870843 0.364085
C  -0.812253 1.270795 0.541392
C  3.051643 1.44971 -0.079698
C  -1.269727 -0.027404 -0.112438
C  4.238862 0.553571 0.24884
C  -2.655787 -0.438787 0.354635
C  5.568266 1.143212 -0.196532
C  -3.133786 -1.732383 -0.239233
H  0.719407 2.769144 0.447797
H  0.47722 1.913177 -1.056946
H  1.736135 0.692265 1.445484
H  1.579702 -0.111347 -0.10026
H  -0.759602 1.135039 1.627771
H  -1.568578 2.043893 0.372009
H  3.026868 1.635193 -1.159673
H  3.198224 2.429359 0.389472
H  -0.5588 -0.826961 0.107224
H  -1.268829 0.097469 -1.199564
H  4.097227 -0.424238 -0.22254
H  4.26528 0.366795 1.327203
H  -3.391129 0.338705 0.125199
H  -2.678428 -0.546177 1.444895
H  5.588584 1.308893 -1.276047
H  6.403926 0.485289 0.048169
H  5.75938 2.105188 0.284394
H  -4.660896 -2.852318 -0.282695
elementType: O C H
totalener: -504.36039267 hartree
nucrepener: 602.48979357 hartree
electener: -1106.85018624 hartree
oneelecener: -1878.00805959 hartree
twoeener: 771.15787334 hartree
cpcmener: -0.01728197 hartree
kineticenergy: 501.94816676 hartree
xcener: -49.759895931974 hartree
chargesum: 0.0000000
charge: -0.305815 -0.453402 -0.128417 -0.108071 -0.136446 -0.117664 -0.086038 -0.074817 -0.152132 -0.281609 0.405281 0.071737 0.062240 0.057179 0.060863 0.065217 0.074883 0.056552 0.055546 0.061238 0.066754 0.053943 0.053302 0.099897 0.102304 0.077606 0.089720 0.077101 0.253050
qa: -0.3058 -0.4534 -0.1284 -0.1081 -0.1364 -0.1177 -0.0860 -0.0748 -0.1521 -0.2816 0.4053 0.0717 0.0622 0.0572 0.0609 0.0652 0.0749 0.0566 0.0555 0.0612 0.0668 0.0539 0.0533 0.0999 0.1023 0.0776 0.0897 0.0771 0.2530
va: 2.1804 2.0348 3.8993 3.8722 3.9204 3.8892 3.8562 3.8725 3.8459 3.9482 4.2275 1.0110 1.0093 1.0098 1.0086 1.0087 1.0102 1.0078 1.0094 1.0225 1.0152 1.0073 1.0071 1.0183 1.0140 1.0007 1.0042 1.0010 0.9975
dispcorr: -0.009169630 hartree
energy: -504.369562302462
dipole: 20.59317 -21.16644 -0.57326 11.75895 -11.24453 0.51441 2.17815 -1.60682 0.57132
magnitude: 0.95899 au
magnitude: 2.43756 debye
