program: Orca
programVersion: 5.0.2
elementType: O O C C C C C C C C C H H H H H H H H H H H H H H H H H H
charge: 0
multiplicity: 1
keywords: wb97x-d3
keywords: def2-TZVPP
keywords: def2/J RIJCOSX
keywords: DEFGRID2
keywords: scfconv7
keywords: smallprint printgap noloewdin
keywords: NOSOSCF
formula: C9H18O2
InChI: InChI=1/C9H18O2/c1-2-3-4-5-6-7-8-9(10)11/h10H,2-8H2,1H3
29 atoms
O  -4.09843 -1.617515 -0.977519
O  -3.566997 -1.991861 1.153839
C  0.732851 0.487083 0.325865
C  2.029167 1.209869 -0.019584
C  -0.453274 0.974836 -0.497411
C  3.219976 0.719779 0.796043
C  -1.795271 0.380331 -0.084379
C  4.510435 1.495413 0.547949
C  -1.88488 -1.131839 -0.32805
C  5.063104 1.343631 -0.862202
C  -3.246896 -1.638426 0.04436
H  0.874514 -0.589256 0.184025
H  0.51278 0.626063 1.390518
H  2.231586 1.091441 -1.088915
H  1.898086 2.285471 0.146255
H  -0.522259 2.063542 -0.408852
H  -0.27542 0.769216 -1.558417
H  2.968519 0.781249 1.859971
H  3.391271 -0.342854 0.588907
H  -2.592368 0.879777 -0.641203
H  -1.977726 0.587514 0.974086
H  5.266988 1.161819 1.26377
H  4.341923 2.555922 0.76232
H  -1.149572 -1.659215 0.280312
H  -1.672347 -1.347702 -1.376905
H  4.390388 1.756626 -1.615459
H  5.228455 0.292771 -1.110931
H  6.019387 1.85847 -0.969389
H  -4.97725 -1.905482 -0.684738
elementType: O C H
totalener: -504.35800383 hartree
nucrepener: 605.17195860 hartree
electener: -1109.52996242 hartree
oneelecener: -1883.16007002 hartree
twoeener: 773.63010760 hartree
cpcmener: -0.01738516 hartree
kineticenergy: 501.94933682 hartree
xcener: -49.759830423862 hartree
chargesum: 0.0000000
charge: -0.300321 -0.457092 -0.115545 -0.127243 -0.118886 -0.106794 -0.160385 -0.111357 -0.099730 -0.276395 0.383598 0.061129 0.061017 0.062518 0.058611 0.072310 0.066470 0.066031 0.060554 0.093874 0.081913 0.068313 0.053448 0.090804 0.090455 0.079496 0.078515 0.091153 0.253540
qa: -0.3003 -0.4571 -0.1155 -0.1272 -0.1189 -0.1068 -0.1604 -0.1114 -0.0997 -0.2764 0.3836 0.0611 0.0610 0.0625 0.0586 0.0723 0.0665 0.0660 0.0606 0.0939 0.0819 0.0683 0.0534 0.0908 0.0905 0.0795 0.0785 0.0912 0.2535
va: 2.1738 2.0340 3.8836 3.8833 3.8903 3.8768 3.9101 3.8987 3.7925 3.9274 4.2331 1.0080 1.0099 1.0064 1.0098 1.0113 1.0092 1.0119 1.0091 1.0155 1.0147 1.0072 1.0086 1.0260 1.0220 0.9986 1.0009 1.0044 0.9968
dispcorr: -0.009515206 hartree
energy: -504.367519032225
dipole: 22.39435 -22.19931 0.19504 10.21121 -9.78513 0.42608 -1.86426 0.98069 -0.88357
magnitude: 1.00014 au
magnitude: 2.54215 debye
