program: Orca
programVersion: 5.0.2
elementType: O O C C C C C C C C C H H H H H H H H H H H H H H H H H H
charge: 0
multiplicity: 1
keywords: wb97x-d3
keywords: def2-TZVPP
keywords: def2/J RIJCOSX
keywords: DEFGRID2
keywords: scfconv7
keywords: smallprint printgap noloewdin
keywords: NOSOSCF
formula: C9H18O2
InChI: InChI=1/C9H18O2/c1-2-3-4-5-6-7-8-9(10)11/h10H,2-8H2,1H3
29 atoms
O  -1.474126 -2.465545 -0.405799
O  -3.41499 -1.393352 -0.619194
C  0.405419 0.890548 -0.795876
C  1.161796 1.672096 0.272788
C  -1.084849 1.217066 -0.860781
C  2.676533 1.494985 0.217989
C  -1.87196 0.930929 0.416496
C  3.159635 0.087935 0.550205
C  -1.78064 -0.516353 0.900863
C  4.677188 -0.020411 0.563764
C  -2.321422 -1.484058 -0.114103
H  0.846395 1.112696 -1.773295
H  0.543844 -0.18475 -0.649916
H  0.925365 2.735847 0.161658
H  0.807179 1.389649 1.269885
H  -1.207342 2.276368 -1.107055
H  -1.533085 0.66848 -1.695481
H  3.039641 1.778316 -0.776474
H  3.139824 2.198536 0.917613
H  -2.920619 1.191935 0.257374
H  -1.524063 1.576528 1.225651
H  2.753927 -0.629311 -0.168661
H  2.763791 -0.206741 1.52776
H  -2.385243 -0.629385 1.805702
H  -0.757982 -0.776345 1.174178
H  5.117607 0.654123 1.301264
H  5.102681 0.236108 -0.408819
H  5.006794 -1.03178 0.807399
H  -1.869682 -3.063069 -1.060276
elementType: O C H
totalener: -504.35711728 hartree
nucrepener: 638.37804339 hartree
electener: -1142.73516067 hartree
oneelecener: -1949.61757457 hartree
twoeener: 806.88241390 hartree
cpcmener: -0.01728146 hartree
kineticenergy: 501.94620228 hartree
xcener: -49.761741100277 hartree
chargesum: -0.0000000
charge: -0.297756 -0.459487 -0.110978 -0.132581 -0.166164 -0.135133 -0.150088 -0.072246 -0.125321 -0.284857 0.392885 0.077523 0.057932 0.074907 0.062457 0.077439 0.081196 0.058114 0.069819 0.087126 0.085095 0.056978 0.053802 0.116364 0.082764 0.078021 0.078747 0.089216 0.254225
qa: -0.2978 -0.4595 -0.1110 -0.1326 -0.1662 -0.1351 -0.1501 -0.0722 -0.1253 -0.2849 0.3929 0.0775 0.0579 0.0749 0.0625 0.0774 0.0812 0.0581 0.0698 0.0871 0.0851 0.0570 0.0538 0.1164 0.0828 0.0780 0.0787 0.0892 0.2542
va: 2.1720 2.0337 3.8391 3.8862 3.8988 3.9021 3.9002 3.8506 3.8345 3.9508 4.2027 1.0110 1.0124 1.0110 1.0073 1.0083 1.0141 1.0094 1.0088 1.0204 1.0063 1.0068 1.0074 1.0099 1.0189 1.0013 1.0003 1.0036 0.9969
dispcorr: -0.010895156 hartree
energy: -504.368012437228
dipole: 16.66399 -15.79592 0.86807 8.77728 -8.87151 -0.09423 2.59182 -2.27176 0.32006
magnitude: 0.92998 au
magnitude: 2.36381 debye
