program: Orca
programVersion: 5.0.2
elementType: O O C C C C C C C C C H H H H H H H H H H H H H H H H H H
charge: 0
multiplicity: 1
keywords: wb97x-d3
keywords: def2-TZVPP
keywords: def2/J RIJCOSX
keywords: DEFGRID2
keywords: scfconv7
keywords: smallprint printgap noloewdin
keywords: NOSOSCF
formula: C9H18O2
InChI: InChI=1/C9H18O2/c1-2-3-4-5-6-7-8-9(10)11/h10H,2-8H2,1H3
29 atoms
O  -3.977285 -2.074683 0.83926
O  -4.243955 -1.606749 -1.324584
C  1.051639 0.110388 -0.030047
C  2.036455 1.248271 0.206041
C  -0.405377 0.532671 0.108225
C  3.490848 0.816638 0.0690
C  -1.375273 -0.618646 -0.123252
C  4.483194 1.947523 0.308038
C  -2.837981 -0.182832 0.010801
C  5.932028 1.502412 0.172248
C  -3.767548 -1.334552 -0.257411
H  1.213954 -0.308532 -1.028858
H  1.261225 -0.702197 0.673777
H  1.830249 2.061202 -0.498501
H  1.874536 1.668317 1.204659
H  -0.570524 0.953857 1.105591
H  -0.620621 1.339165 -0.600562
H  3.695126 0.001357 0.771633
H  3.6531 0.397701 -0.930128
H  -1.165012 -1.42174 0.58836
H  -1.215159 -1.036207 -1.121188
H  4.321387 2.366887 1.305661
H  4.282481 2.761173 -0.395481
H  -3.055706 0.603112 -0.713083
H  -3.011432 0.21948 1.010914
H  6.134781 1.111148 -0.82607
H  6.173021 0.713983 0.887076
H  6.622996 2.327141 0.348194
H  -4.539852 -2.821224 0.594009
totalener: -504.34459192 hartree
nucrepener: 592.25744639 hartree
electener: -1096.60203831 hartree
oneelecener: -1857.24474998 hartree
twoeener: 760.64271167 hartree
kineticenergy: 501.98496551 hartree
xcener: -49.758410094684 hartree
chargesum: 0.0000000
charge: -0.268599 -0.347098 -0.102177 -0.103690 -0.113291 -0.104895 -0.151044 -0.080462 -0.090384 -0.257439 0.308325 0.057475 0.055694 0.054545 0.053521 0.057237 0.058921 0.052154 0.053004 0.077690 0.082715 0.051879 0.052311 0.087823 0.084834 0.072548 0.072051 0.084416 0.201938
qa: -0.2686 -0.3471 -0.1022 -0.1037 -0.1133 -0.1049 -0.1510 -0.0805 -0.0904 -0.2574 0.3083 0.0575 0.0557 0.0545 0.0535 0.0572 0.0589 0.0522 0.0530 0.0777 0.0827 0.0519 0.0523 0.0878 0.0848 0.0725 0.0721 0.0844 0.2019
va: 2.1771 2.1468 3.8904 3.8911 3.8878 3.8909 3.9059 3.8906 3.8265 3.9547 4.2870 1.0125 1.0125 1.0124 1.0123 1.0113 1.0115 1.0106 1.0106 1.0167 1.0139 1.0078 1.0079 1.0234 1.0201 1.0033 1.0031 1.0061 1.0432
dispcorr: -0.008911156 hartree
energy: -504.353503080671
dipole: 25.21220 -24.76694 0.44526 9.57694 -9.45445 0.12249 2.20064 -1.57185 0.62880
magnitude: 0.78016 au
magnitude: 1.98301 debye
