program: Orca
programVersion: 5.0.2
elementType: O O C C C C C C C C C H H H H H H H H H H H H H H H H H H
charge: 0
multiplicity: 1
keywords: wb97x-d3
keywords: def2-TZVPP
keywords: def2/J RIJCOSX
keywords: DEFGRID2
keywords: scfconv7
keywords: smallprint printgap noloewdin
keywords: NOSOSCF
formula: C9H18O2
InChI: InChI=1/C9H18O2/c1-2-3-4-5-6-7-8-9(10)11/h10H,2-8H2,1H3
29 atoms
O  -3.129252 -1.754705 -1.305899
O  -3.307788 -2.282262 0.851967
C  0.572589 0.953382 -0.241216
C  1.869526 0.489011 0.408801
C  -0.658522 0.23897 0.299986
C  3.102702 1.185582 -0.15075
C  -1.95242 0.727437 -0.338903
C  4.400871 0.744303 0.513158
C  -3.201538 0.042537 0.217937
C  5.625835 1.439261 -0.063306
C  -3.219598 -1.446461 -0.00415
H  0.461367 2.033497 -0.096509
H  0.632838 0.80035 -1.324097
H  1.814084 0.657898 1.489585
H  1.973492 -0.593772 0.280222
H  -0.544116 -0.838279 0.139725
H  -0.714981 0.37523 1.385039
H  3.166073 1.000783 -1.228691
H  2.990589 2.269687 -0.039483
H  -1.907699 0.593247 -1.422071
H  -2.053978 1.80295 -0.170802
H  4.511136 -0.339401 0.409603
H  4.341463 0.93812 1.588367
H  -4.091058 0.470302 -0.253789
H  -3.287498 0.217207 1.290413
H  5.559553 2.521921 0.055747
H  5.731948 1.234164 -1.129842
H  6.542199 1.110408 0.427245
H  -3.143749 -2.717256 -1.386965
totalener: -504.34447601 hartree
nucrepener: 606.14255300 hartree
electener: -1110.48702901 hartree
oneelecener: -1885.08919050 hartree
twoeener: 774.60216150 hartree
kineticenergy: 501.98548539 hartree
xcener: -49.759412649476 hartree
chargesum: -0.0000000
charge: -0.270485 -0.339978 -0.107051 -0.099403 -0.118489 -0.104487 -0.119848 -0.078859 -0.127594 -0.257406 0.308753 0.054938 0.056956 0.054045 0.054434 0.064670 0.061057 0.051586 0.051273 0.076985 0.071914 0.052046 0.052017 0.097037 0.085618 0.071743 0.071877 0.084636 0.202015
qa: -0.2705 -0.3400 -0.1071 -0.0994 -0.1185 -0.1045 -0.1198 -0.0789 -0.1276 -0.2574 0.3088 0.0549 0.0570 0.0540 0.0544 0.0647 0.0611 0.0516 0.0513 0.0770 0.0719 0.0520 0.0520 0.0970 0.0856 0.0717 0.0719 0.0846 0.2020
va: 2.1601 2.1516 3.8766 3.8912 3.8969 3.8878 3.8718 3.8912 3.8576 3.9539 4.2639 1.0124 1.0124 1.0128 1.0134 1.0179 1.0119 1.0107 1.0105 1.0204 1.0117 1.0080 1.0081 1.0125 1.0245 1.0032 1.0032 1.0062 1.0431
dispcorr: -0.009353951 hartree
energy: -504.353829957793
dipole: 20.77159 -20.59362 0.17797 10.80917 -10.33313 0.47604 -0.04273 -0.50149 -0.54422
magnitude: 0.74462 au
magnitude: 1.89268 debye
