program: Orca
programVersion: 5.0.2
elementType: O O C C C C C C C C C H H H H H H H H H H H H H H H H H H
charge: 0
multiplicity: 1
keywords: wb97x-d3
keywords: def2-TZVPP
keywords: def2/J RIJCOSX
keywords: DEFGRID2
keywords: scfconv7
keywords: smallprint printgap noloewdin
keywords: NOSOSCF
formula: C9H18O2
InChI: InChI=1/C9H18O2/c1-2-3-4-5-6-7-8-9(10)11/h10H,2-8H2,1H3
29 atoms
O  -2.640152 -2.673574 -0.431214
O  -0.741567 -1.95769 0.487472
C  0.251799 2.282915 -0.480121
C  1.182476 2.112316 0.721319
C  -0.676217 1.100784 -0.74668
C  2.023886 0.838446 0.712851
C  -1.606083 0.776203 0.416632
C  2.939226 0.696816 -0.497341
C  -2.542899 -0.388189 0.133712
C  3.813047 -0.547374 -0.421128
C  -1.850525 -1.726296 0.088914
H  -0.347689 3.186894 -0.332418
H  0.845544 2.469133 -1.379199
H  1.845793 2.981575 0.769561
H  0.597788 2.140963 1.645248
H  -1.280752 1.322912 -1.632214
H  -0.082217 0.21988 -1.003042
H  2.635885 0.823855 1.620392
H  1.377173 -0.041862 0.781861
H  -2.211716 1.65768 0.646505
H  -1.02958 0.559999 1.317826
H  3.570158 1.587313 -0.584683
H  2.344318 0.659643 -1.414389
H  -3.091646 -0.236135 -0.799664
H  -3.310277 -0.455835 0.912548
H  3.203916 -1.45053 -0.35981
H  4.455493 -0.526872 0.460816
H  4.457248 -0.641605 -1.29582
H  -2.161813 -3.512723 -0.406865
totalener: -504.34304704 hartree
nucrepener: 647.70125816 hartree
electener: -1152.04430520 hartree
oneelecener: -1968.52066137 hartree
twoeener: 816.47635617 hartree
kineticenergy: 501.97806213 hartree
xcener: -49.763633036676 hartree
chargesum: -0.0000000
charge: -0.270393 -0.356109 -0.160959 -0.153599 -0.130620 -0.113881 -0.116404 -0.092891 -0.149493 -0.256897 0.334851 0.072075 0.077872 0.071624 0.073807 0.074362 0.072559 0.066842 0.071441 0.075021 0.077560 0.056910 0.049303 0.088438 0.103187 0.080593 0.069838 0.081116 0.203846
qa: -0.2704 -0.3561 -0.1610 -0.1536 -0.1306 -0.1139 -0.1164 -0.0929 -0.1495 -0.2569 0.3349 0.0721 0.0779 0.0716 0.0738 0.0744 0.0726 0.0668 0.0714 0.0750 0.0776 0.0569 0.0493 0.0884 0.1032 0.0806 0.0698 0.0811 0.2038
va: 2.1893 2.1125 3.9044 3.8957 3.8521 3.8596 3.8569 3.8695 3.8617 3.9539 4.2322 1.0107 1.0027 1.0101 1.0038 1.0115 1.0157 1.0117 1.0162 1.0139 1.0187 1.0082 1.0072 1.0223 1.0158 1.0036 1.0045 1.0051 1.0425
dispcorr: -0.011225060 hartree
energy: -504.354272099624
dipole: 11.00884 -11.62786 -0.61902 10.16776 -10.11600 0.05176 -0.87786 0.69521 -0.18265
magnitude: 0.64748 au
magnitude: 1.64577 debye
