program: Orca
programVersion: 5.0.2
elementType: O O C C C C C C C C C H H H H H H H H H H H H H H H H H H
charge: 0
multiplicity: 1
keywords: wb97x-d3
keywords: def2-TZVPP
keywords: def2/J RIJCOSX
keywords: DEFGRID2
keywords: scfconv7
keywords: smallprint printgap noloewdin
keywords: NOSOSCF
formula: C9H18O2
InChI: InChI=1/C9H18O2/c1-2-3-4-5-6-7-8-9(10)11/h10H,2-8H2,1H3
29 atoms
O  -2.180481 -2.43734 0.724223
O  -2.159231 -1.630941 -1.351956
C  0.052192 0.658419 -0.106026
C  1.396025 1.310264 0.196369
C  -1.118625 1.607799 0.120168
C  2.578928 0.370894 0.001322
C  -2.488347 1.070309 -0.285452
C  3.922848 1.026314 0.293415
C  -2.902604 -0.205923 0.442066
C  5.100426 0.084522 0.08794
C  -2.364481 -1.468412 -0.180707
H  0.042311 0.297978 -1.138901
H  -0.055143 -0.228953 0.527355
H  1.523321 2.190144 -0.443499
H  1.396537 1.685829 1.225646
H  -1.145312 1.895853 1.177023
H  -0.936893 2.533337 -0.434815
H  2.456195 -0.506952 0.645017
H  2.575561 -0.009053 -1.026034
H  -2.522422 0.898665 -1.363258
H  -3.232625 1.841758 -0.076533
H  3.927493 1.399956 1.321879
H  4.042659 1.906299 -0.345616
H  -3.993399 -0.305094 0.415853
H  -2.634541 -0.163199 1.499893
H  5.025109 -0.79034 0.735964
H  6.049866 0.574059 0.305801
H  5.144497 -0.275041 -0.941407
H  -1.881237 -3.228811 0.257232
totalener: -504.34339153 hartree
nucrepener: 625.69393820 hartree
electener: -1130.03732973 hartree
oneelecener: -1924.33388181 hartree
twoeener: 794.29655208 hartree
kineticenergy: 501.98065373 hartree
xcener: -49.760204994362 hartree
chargesum: 0.0000000
charge: -0.269283 -0.348060 -0.101163 -0.117250 -0.132142 -0.095962 -0.123808 -0.080496 -0.139109 -0.258239 0.312248 0.079179 0.045223 0.055045 0.052663 0.059903 0.065023 0.050385 0.054829 0.083858 0.077517 0.051203 0.051928 0.100709 0.092370 0.071456 0.084061 0.072842 0.205071
qa: -0.2693 -0.3481 -0.1012 -0.1173 -0.1321 -0.0960 -0.1238 -0.0805 -0.1391 -0.2582 0.3122 0.0792 0.0452 0.0550 0.0527 0.0599 0.0650 0.0504 0.0548 0.0839 0.0775 0.0512 0.0519 0.1007 0.0924 0.0715 0.0841 0.0728 0.2051
va: 2.1821 2.1395 3.8582 3.9046 3.9080 3.8840 3.8845 3.8896 3.8239 3.9545 4.2643 1.0143 1.0205 1.0130 1.0111 1.0100 1.0143 1.0113 1.0114 1.0248 1.0090 1.0076 1.0081 1.0112 1.0191 1.0032 1.0062 1.0032 1.0423
dispcorr: -0.010029778 hartree
energy: -504.353421308030
dipole: 15.10136 -15.19444 -0.09308 9.24746 -9.15053 0.09693 2.27814 -1.69771 0.58042
magnitude: 0.59578 au
magnitude: 1.51435 debye
