program: Orca
programVersion: 5.0.2
elementType: O O C C C C C C C C C H H H H H H H H H H H H H H H H H H
charge: 0
multiplicity: 1
keywords: wb97x-d3
keywords: def2-TZVPP
keywords: def2/J RIJCOSX
keywords: DEFGRID2
keywords: scfconv7
keywords: smallprint printgap noloewdin
keywords: NOSOSCF
formula: C9H18O2
InChI: InChI=1/C9H18O2/c1-2-3-4-5-6-7-8-9(10)11/h10H,2-8H2,1H3
29 atoms
O  -4.133383 -1.305204 -0.001361
O  -2.637016 -2.914627 -0.379209
C  0.845301 0.7439 0.226042
C  1.803606 1.876437 0.575875
C  -0.517667 1.252812 -0.227573
C  3.143886 1.408956 1.137662
C  -1.486769 0.161926 -0.671393
C  3.963364 0.513821 0.210612
C  -1.879651 -0.791393 0.463536
C  4.312401 1.164067 -1.121119
C  -2.889113 -1.802495 -0.005767
H  1.272668 0.119996 -0.565841
H  0.735949 0.0912 1.09824
H  1.964174 2.501318 -0.308221
H  1.326537 2.529604 1.313197
H  -0.976109 1.839209 0.575865
H  -0.376602 1.947665 -1.06096
H  3.740945 2.288206 1.398918
H  2.96719 0.87652 2.077482
H  -1.042057 -0.414489 -1.487402
H  -2.38757 0.629479 -1.075493
H  3.432311 -0.42503 0.030917
H  4.885371 0.23373 0.726438
H  -2.28677 -0.214052 1.296927
H  -1.008201 -1.336859 0.823617
H  3.425382 1.361034 -1.724778
H  4.968109 0.524588 -1.712272
H  4.826483 2.115869 -0.974564
H  -4.727902 -1.982886 -0.349127
totalener: -504.34131312 hartree
nucrepener: 616.21588344 hartree
electener: -1120.55719656 hartree
oneelecener: -1905.16955426 hartree
twoeener: 784.61235770 hartree
kineticenergy: 501.98530141 hartree
xcener: -49.762039313776 hartree
chargesum: 0.0000000
charge: -0.269312 -0.344702 -0.124918 -0.135148 -0.130316 -0.141379 -0.159395 -0.116524 -0.100082 -0.251838 0.306046 0.063706 0.063606 0.067444 0.073176 0.064694 0.072597 0.073471 0.066805 0.083976 0.093603 0.060548 0.069956 0.087979 0.087970 0.069974 0.087734 0.078101 0.202227
qa: -0.2693 -0.3447 -0.1249 -0.1351 -0.1303 -0.1414 -0.1594 -0.1165 -0.1001 -0.2518 0.3060 0.0637 0.0636 0.0674 0.0732 0.0647 0.0726 0.0735 0.0668 0.0840 0.0936 0.0605 0.0700 0.0880 0.0880 0.0700 0.0877 0.0781 0.2022
va: 2.1778 2.1475 3.8512 3.8846 3.8909 3.9032 3.9013 3.8876 3.7906 3.9337 4.3010 1.0076 1.0097 1.0048 1.0124 1.0111 1.0133 1.0088 1.0118 1.0117 1.0187 1.0034 1.0088 1.0181 1.0293 1.0006 1.0075 1.0031 1.0432
dispcorr: -0.010058937 hartree
energy: -504.351372054177
dipole: 19.33503 -19.40886 -0.07382 11.87484 -11.13884 0.73599 -0.04069 0.17921 0.13852
magnitude: 0.75255 au
magnitude: 1.91282 debye
