program: Orca
programVersion: 5.0.2
elementType: O O C C C C C C C C C H H H H H H H H H H H H H H H H H H
charge: 0
multiplicity: 1
keywords: wb97x-d3
keywords: def2-TZVPP
keywords: def2/J RIJCOSX
keywords: DEFGRID2
keywords: scfconv7
keywords: smallprint printgap noloewdin
keywords: NOSOSCF
formula: C9H18O2
InChI: InChI=1/C9H18O2/c1-2-3-4-5-6-7-8-9(10)11/h10H,2-8H2,1H3
29 atoms
O  -1.403252 -2.394873 0.708093
O  -1.745075 -1.62815 -1.354904
C  0.067422 1.028467 -0.167671
C  1.288838 1.900075 0.102216
C  -1.241608 1.738346 0.156142
C  2.615393 1.248068 -0.277883
C  -2.507106 0.962354 -0.20069
C  2.967133 0.008398 0.536546
C  -2.634109 -0.38567 0.505797
C  4.32855 -0.564894 0.169439
C  -1.880653 -1.503332 -0.168971
H  0.067052 0.715287 -1.2165
H  0.144427 0.112479 0.425421
H  1.184473 2.837094 -0.453775
H  1.310921 2.180346 1.161185
H  -1.260908 1.984037 1.223733
H  -1.267677 2.697085 -0.3708
H  2.598116 0.988554 -1.342134
H  3.417534 1.983899 -0.161951
H  -2.566091 0.810999 -1.280457
H  -3.371362 1.573414 0.068437
H  2.204872 -0.762278 0.395808
H  2.949675 0.260146 1.601671
H  -3.684237 -0.696844 0.508293
H  -2.341667 -0.310528 1.554968
H  5.12337 0.164564 0.333488
H  4.363672 -0.855101 -0.881883
H  4.565626 -1.448426 0.762449
H  -0.97393 -3.102721 0.209237
totalener: -504.34229164 hartree
nucrepener: 640.54808003 hartree
electener: -1144.89037167 hartree
oneelecener: -1954.01905610 hartree
twoeener: 809.12868443 hartree
kineticenergy: 501.98063039 hartree
xcener: -49.761403789512 hartree
chargesum: -0.0000000
charge: -0.269241 -0.347201 -0.106156 -0.126444 -0.143033 -0.120268 -0.121431 -0.080026 -0.135580 -0.262602 0.310822 0.083004 0.047783 0.067411 0.058028 0.061591 0.065908 0.058305 0.066520 0.084558 0.077962 0.049954 0.054731 0.099020 0.090950 0.072986 0.074565 0.082682 0.205201
qa: -0.2692 -0.3472 -0.1062 -0.1264 -0.1430 -0.1203 -0.1214 -0.0800 -0.1356 -0.2626 0.3108 0.0830 0.0478 0.0674 0.0580 0.0616 0.0659 0.0583 0.0665 0.0846 0.0780 0.0500 0.0547 0.0990 0.0909 0.0730 0.0746 0.0827 0.2052
va: 2.1813 2.1416 3.8392 3.9146 3.9192 3.8994 3.8847 3.8666 3.8273 3.9597 4.2602 1.0116 1.0182 1.0134 1.0104 1.0089 1.0151 1.0108 1.0116 1.0243 1.0091 1.0101 1.0066 1.0106 1.0194 1.0039 1.0026 1.0055 1.0424
dispcorr: -0.010607067 hartree
energy: -504.352898705542
dipole: 11.83138 -11.89233 -0.06095 8.71413 -8.63411 0.08002 2.36270 -1.76877 0.59393
magnitude: 0.60239 au
magnitude: 1.53116 debye
