program: Orca
programVersion: 5.0.2
elementType: O O C C C C C C C C C H H H H H H H H H H H H H H H H H H
charge: 0
multiplicity: 1
keywords: wb97x-d3
keywords: def2-TZVPP
keywords: def2/J RIJCOSX
keywords: DEFGRID2
keywords: scfconv7
keywords: smallprint printgap noloewdin
keywords: NOSOSCF
formula: C9H18O2
InChI: InChI=1/C9H18O2/c1-2-3-4-5-6-7-8-9(10)11/h10H,2-8H2,1H3
29 atoms
O  -4.296357 -0.713222 0.469137
O  -3.820178 -2.502764 -0.770505
C  0.973789 0.379746 1.044188
C  2.175974 1.261967 0.71885
C  -0.057825 0.277736 -0.07338
C  3.045271 0.739302 -0.419035
C  -1.297945 -0.502058 0.344385
C  4.251253 1.620929 -0.734108
C  -2.311831 -0.623289 -0.796672
C  5.268486 1.719339 0.394985
C  -3.537229 -1.39856 -0.396715
H  1.321842 -0.624638 1.308373
H  0.48355 0.7717 1.940706
H  1.828836 2.272388 0.474959
H  2.780624 1.363092 1.623936
H  -0.352442 1.285007 -0.388169
H  0.385191 -0.197366 -0.953478
H  3.389398 -0.272447 -0.176062
H  2.44329 0.642226 -1.326634
H  -1.764331 -0.013169 1.203061
H  -1.004604 -1.502079 0.677136
H  3.904894 2.623972 -1.001699
H  4.747613 1.228746 -1.62547
H  -1.857889 -1.130363 -1.648124
H  -2.608209 0.376824 -1.124236
H  6.138983 2.300752 0.090517
H  5.622628 0.730956 0.693857
H  4.854542 2.201137 1.281021
H  -5.049567 -1.267273 0.71214
totalener: -504.34215911 hartree
nucrepener: 603.17411206 hartree
electener: -1107.51627117 hartree
oneelecener: -1879.07665362 hartree
twoeener: 771.56038245 hartree
kineticenergy: 501.98689370 hartree
xcener: -49.761183045682 hartree
chargesum: 0.0000000
charge: -0.269905 -0.342398 -0.126448 -0.133241 -0.114329 -0.111120 -0.148764 -0.114651 -0.081212 -0.255738 0.298937 0.062768 0.069713 0.060324 0.074769 0.059214 0.059655 0.060906 0.068341 0.079459 0.077548 0.052876 0.067878 0.084353 0.084535 0.086014 0.075385 0.073475 0.201656
qa: -0.2699 -0.3424 -0.1264 -0.1332 -0.1143 -0.1111 -0.1488 -0.1147 -0.0812 -0.2557 0.2989 0.0628 0.0697 0.0603 0.0748 0.0592 0.0597 0.0609 0.0683 0.0795 0.0775 0.0529 0.0679 0.0844 0.0845 0.0860 0.0754 0.0735 0.2017
va: 2.1682 2.1481 3.9127 3.8956 3.8696 3.8727 3.9001 3.9107 3.8194 3.9344 4.2877 1.0113 1.0120 1.0095 1.0129 1.0102 1.0096 1.0093 1.0145 1.0217 1.0102 1.0091 1.0068 1.0272 1.0175 1.0067 1.0023 1.0020 1.0434
dispcorr: -0.009474797 hartree
energy: -504.351633905226
dipole: 23.81512 -23.53926 0.27586 9.95055 -9.26258 0.68797 1.86812 -1.54727 0.32085
magnitude: 0.80768 au
magnitude: 2.05297 debye
