program: Orca
programVersion: 5.0.2
elementType: O O C C C C C C C C C H H H H H H H H H H H H H H H H H H
charge: 0
multiplicity: 1
keywords: wb97x-d3
keywords: def2-TZVPP
keywords: def2/J RIJCOSX
keywords: DEFGRID2
keywords: scfconv7
keywords: smallprint printgap noloewdin
keywords: NOSOSCF
formula: C9H18O2
InChI: InChI=1/C9H18O2/c1-2-3-4-5-6-7-8-9(10)11/h10H,2-8H2,1H3
29 atoms
O  -3.050273 -2.467248 -0.534409
O  -1.082373 -2.054066 0.422286
C  0.555202 2.006132 -0.399191
C  1.409077 1.68079 0.82617
C  -0.530323 0.98062 -0.718613
C  2.065285 0.300865 0.805002
C  -1.536091 0.77591 0.40874
C  2.95772 0.029584 -0.403931
C  -2.624956 -0.230413 0.066859
C  4.122688 1.000046 -0.542018
C  -2.137447 -1.654862 0.011519
H  0.092506 2.987397 -0.253537
H  1.199635 2.113538 -1.276691
H  2.175184 2.454519 0.929273
H  0.7995 1.761214 1.730695
H  -1.066062 1.307275 -1.615896
H  -0.067671 0.025206 -0.977135
H  2.661814 0.18833 1.715926
H  1.295922 -0.474351 0.858487
H  -2.011973 1.73273 0.642055
H  -1.029381 0.457523 1.321541
H  2.361367 0.043442 -1.320998
H  3.346444 -0.988855 -0.324826
H  -3.107905 0.018548 -0.881989
H  -3.423793 -0.197815 0.815446
H  4.769422 0.726448 -1.376141
H  4.737252 1.010635 0.36022
H  3.785115 2.022435 -0.718433
H  -2.699946 -3.367649 -0.51785
totalener: -504.34198644 hartree
nucrepener: 647.78411025 hartree
electener: -1152.12609669 hartree
oneelecener: -1968.67183462 hartree
twoeener: 816.54573793 hartree
kineticenergy: 501.97880546 hartree
xcener: -49.765076352349 hartree
chargesum: -0.0000000
charge: -0.270843 -0.354910 -0.146371 -0.169394 -0.140971 -0.123068 -0.113808 -0.112761 -0.151679 -0.253308 0.334230 0.072925 0.074000 0.078693 0.075997 0.074409 0.075243 0.070212 0.080793 0.075581 0.076809 0.051450 0.069786 0.088826 0.103736 0.085700 0.076820 0.067973 0.203930
qa: -0.2708 -0.3549 -0.1464 -0.1694 -0.1410 -0.1231 -0.1138 -0.1128 -0.1517 -0.2533 0.3342 0.0729 0.0740 0.0787 0.0760 0.0744 0.0752 0.0702 0.0808 0.0756 0.0768 0.0515 0.0698 0.0888 0.1037 0.0857 0.0768 0.0680 0.2039
va: 2.1893 2.1133 3.8940 3.8911 3.8612 3.8666 3.8545 3.8944 3.8635 3.9346 4.2329 1.0109 1.0046 1.0030 1.0050 1.0114 1.0162 1.0099 1.0232 1.0138 1.0194 1.0066 1.0094 1.0222 1.0159 1.0076 1.0032 1.0022 1.0424
dispcorr: -0.011489931 hartree
energy: -504.353476372079
dipole: 12.98431 -13.57778 -0.59347 11.20503 -11.10469 0.10034 -0.61886 0.42956 -0.18930
magnitude: 0.63096 au
magnitude: 1.60378 debye
