program: Orca
programVersion: 5.0.2
elementType: O O C C C C C C C C C H H H H H H H H H H H H H H H H H H
charge: 0
multiplicity: 1
keywords: wb97x-d3
keywords: def2-TZVPP
keywords: def2/J RIJCOSX
keywords: DEFGRID2
keywords: scfconv7
keywords: smallprint printgap noloewdin
keywords: NOSOSCF
formula: C9H18O2
InChI: InChI=1/C9H18O2/c1-2-3-4-5-6-7-8-9(10)11/h10H,2-8H2,1H3
29 atoms
O  -4.076268 -2.130706 -0.182403
O  -1.962973 -2.699467 -0.60508
C  0.789345 1.631145 0.716126
C  1.548316 1.571463 -0.605227
C  -0.691843 1.28455 0.599272
C  2.974662 2.109481 -0.518696
C  -0.959781 -0.155387 0.17803
C  3.894162 1.364189 0.446755
C  -2.447415 -0.465769 0.159182
C  4.079075 -0.108151 0.1059
C  -2.762789 -1.878688 -0.251456
H  1.253838 0.961931 1.447504
H  0.882049 2.639902 1.131211
H  1.563703 0.546416 -0.985301
H  1.001796 2.154949 -1.353352
H  -1.174106 1.469797 1.564503
H  -1.169252 1.969069 -0.110598
H  3.420566 2.086864 -1.517989
H  2.938169 3.164541 -0.229553
H  -0.450183 -0.837867 0.863494
H  -0.53675 -0.349093 -0.809282
H  3.519325 1.458819 1.469457
H  4.869691 1.85739 0.445321
H  -2.973429 0.210174 -0.523445
H  -2.89486 -0.283591 1.141413
H  4.796792 -0.581112 0.776426
H  4.449044 -0.234313 -0.913162
H  3.146169 -0.667374 0.185802
H  -4.222035 -3.044667 -0.459537
totalener: -504.34259978 hartree
nucrepener: 618.13400659 hartree
electener: -1122.47660636 hartree
oneelecener: -1909.17451002 hartree
twoeener: 786.69790365 hartree
kineticenergy: 501.98737987 hartree
xcener: -49.763273218436 hartree
chargesum: 0.0000000
charge: -0.271044 -0.346383 -0.130901 -0.130128 -0.127821 -0.144915 -0.075754 -0.115024 -0.164403 -0.252895 0.333566 0.060990 0.074960 0.067206 0.073318 0.068724 0.059631 0.072313 0.065917 0.067364 0.070206 0.058861 0.068444 0.088053 0.088654 0.086390 0.077518 0.074437 0.202715
qa: -0.2710 -0.3464 -0.1309 -0.1301 -0.1278 -0.1449 -0.0758 -0.1150 -0.1644 -0.2529 0.3336 0.0610 0.0750 0.0672 0.0733 0.0687 0.0596 0.0723 0.0659 0.0674 0.0702 0.0589 0.0684 0.0881 0.0887 0.0864 0.0775 0.0744 0.2027
va: 2.1903 2.1422 3.8900 3.8662 3.9012 3.9126 3.8463 3.8850 3.8409 3.9340 4.2908 1.0095 1.0114 1.0044 1.0120 1.0112 1.0107 1.0088 1.0116 1.0194 1.0245 1.0048 1.0091 1.0183 1.0210 1.0072 1.0033 1.0005 1.0429
dispcorr: -0.010058348 hartree
energy: -504.352658125628
dipole: 17.28844 -17.66403 -0.37559 11.71507 -11.24618 0.46889 2.03254 -1.84430 0.18824
magnitude: 0.62957 au
magnitude: 1.60024 debye
