program: Orca
programVersion: 5.0.2
elementType: O O C C C C C C C C C H H H H H H H H H H H H H H H H H H
charge: 0
multiplicity: 1
keywords: wb97x-d3
keywords: def2-TZVPP
keywords: def2/J RIJCOSX
keywords: DEFGRID2
keywords: scfconv7
keywords: smallprint printgap noloewdin
keywords: NOSOSCF
formula: C9H18O2
InChI: InChI=1/C9H18O2/c1-2-3-4-5-6-7-8-9(10)11/h10H,2-8H2,1H3
29 atoms
O  -4.28312 -1.851762 0.498237
O  -2.70471 -1.948394 -1.071846
C  0.931748 0.481483 -0.114394
C  2.143819 -0.107641 0.597199
C  -0.389988 -0.071432 0.402979
C  3.486521 0.358925 0.042108
C  -1.595216 0.571131 -0.272116
C  3.74754 1.853171 0.19458
C  -2.931864 0.060871 0.244252
C  5.129478 2.259733 -0.296273
C  -3.256148 -1.343489 -0.194175
H  0.928504 1.570759 -0.007589
H  1.010067 0.282893 -1.188914
H  2.089803 0.133998 1.664605
H  2.094846 -1.19917 0.534388
H  -0.411969 -1.154121 0.252477
H  -0.4520 0.091291 1.485073
H  4.287715 -0.191336 0.545938
H  3.557126 0.08546 -1.01658
H  -1.538022 0.420107 -1.352394
H  -1.557412 1.652164 -0.11153
H  3.634523 2.133557 1.246795
H  2.991962 2.423677 -0.351732
H  -3.74665 0.699881 -0.113107
H  -2.979226 0.116354 1.335356
H  5.915284 1.743665 0.257903
H  5.296653 3.331171 -0.183135
H  5.26108 2.016218 -1.351902
H  -4.466966 -2.736534 0.156125
totalener: -504.34456465 hartree
nucrepener: 609.08413035 hartree
electener: -1113.42869501 hartree
oneelecener: -1891.13501154 hartree
twoeener: 777.70631653 hartree
kineticenergy: 501.98360143 hartree
xcener: -49.760563531628 hartree
chargesum: -0.0000000
charge: -0.271115 -0.351676 -0.114245 -0.113321 -0.130892 -0.128915 -0.088037 -0.080327 -0.157455 -0.261825 0.325801 0.053351 0.064389 0.056348 0.069762 0.074972 0.052121 0.066190 0.057834 0.075141 0.068274 0.054242 0.053981 0.103906 0.088376 0.072657 0.083203 0.073577 0.203683
qa: -0.2711 -0.3517 -0.1142 -0.1133 -0.1309 -0.1289 -0.0880 -0.0803 -0.1575 -0.2618 0.3258 0.0534 0.0644 0.0563 0.0698 0.0750 0.0521 0.0662 0.0578 0.0751 0.0683 0.0542 0.0540 0.1039 0.0884 0.0727 0.0832 0.0736 0.2037
va: 2.1854 2.1308 3.8863 3.9009 3.8943 3.9046 3.8579 3.8648 3.8638 3.9582 4.2535 1.0104 1.0097 1.0109 1.0129 1.0234 1.0096 1.0116 1.0104 1.0230 1.0134 1.0070 1.0084 1.0160 1.0214 1.0039 1.0055 1.0027 1.0426
dispcorr: -0.009467538 hartree
energy: -504.354032191204
dipole: 20.71762 -21.01977 -0.30215 10.71014 -10.42142 0.28873 1.69306 -1.24961 0.44346
magnitude: 0.60935 au
magnitude: 1.54885 debye
