program: Orca
programVersion: 5.0.2
elementType: O O C C C C C C C C C H H H H H H H H H H H H H H H H H H
charge: 0
multiplicity: 1
keywords: wb97x-d3
keywords: def2-TZVPP
keywords: def2/J RIJCOSX
keywords: DEFGRID2
keywords: scfconv7
keywords: smallprint printgap noloewdin
keywords: NOSOSCF
formula: C9H18O2
InChI: InChI=1/C9H18O2/c1-2-3-4-5-6-7-8-9(10)11/h10H,2-8H2,1H3
29 atoms
O  -1.75876 -2.244578 1.070358
O  -1.578144 -1.849289 -1.114188
C  0.099792 0.918441 0.032437
C  1.281199 1.790611 0.44358
C  -1.197485 1.710689 -0.080695
C  2.570164 1.015251 0.698997
C  -2.398297 0.926753 -0.605452
C  3.138836 0.31479 -0.529511
C  -2.783117 -0.276297 0.252729
C  4.455354 -0.392702 -0.241644
C  -1.969525 -1.513035 -0.030476
H  0.305766 0.424881 -0.920908
H  -0.011429 0.119233 0.773851
H  1.457934 2.550283 -0.325715
H  1.01568 2.340979 1.35183
H  -1.44557 2.134064 0.898987
H  -1.033531 2.567199 -0.741828
H  3.325282 1.702046 1.094388
H  2.396304 0.27641 1.489313
H  -2.215716 0.595417 -1.629832
H  -3.255078 1.602274 -0.652346
H  3.284017 1.048969 -1.328203
H  2.418406 -0.41077 -0.915637
H  -3.822731 -0.551697 0.045541
H  -2.743718 -0.031151 1.315883
H  5.215293 0.308549 0.10734
H  4.847701 -0.886946 -1.130592
H  4.33472 -1.154109 0.530865
H  -1.272269 -3.038939 0.812302
totalener: -504.34230203 hartree
nucrepener: 638.29303824 hartree
electener: -1142.63534027 hartree
oneelecener: -1949.53210856 hartree
twoeener: 806.89676829 hartree
kineticenergy: 501.97973085 hartree
xcener: -49.761098570328 hartree
chargesum: -0.0000000
charge: -0.268346 -0.348883 -0.120866 -0.126338 -0.136763 -0.121504 -0.121028 -0.081875 -0.135760 -0.261065 0.312893 0.086156 0.049071 0.061155 0.066384 0.060447 0.067038 0.066968 0.053821 0.083900 0.077449 0.054217 0.059426 0.099438 0.090948 0.071774 0.084925 0.071489 0.204929
qa: -0.2683 -0.3489 -0.1209 -0.1263 -0.1368 -0.1215 -0.1210 -0.0819 -0.1358 -0.2611 0.3129 0.0862 0.0491 0.0612 0.0664 0.0604 0.0670 0.0670 0.0538 0.0839 0.0774 0.0542 0.0594 0.0994 0.0909 0.0718 0.0849 0.0715 0.2049
va: 2.1830 2.1410 3.8394 3.9090 3.9106 3.8978 3.8876 3.8680 3.8233 3.9569 4.2609 1.0099 1.0211 1.0121 1.0113 1.0111 1.0132 1.0123 1.0109 1.0243 1.0090 1.0075 1.0097 1.0110 1.0201 1.0037 1.0056 1.0030 1.0426
dispcorr: -0.010509286 hartree
energy: -504.352811315742
dipole: 12.18325 -12.37416 -0.19091 9.13964 -8.95641 0.18324 0.79518 -0.26913 0.52604
magnitude: 0.58885 au
magnitude: 1.49674 debye
