program: Orca
programVersion: 5.0.2
elementType: O O C C C C C C C C C H H H H H H H H H H H H H H H H H H
charge: 0
multiplicity: 1
keywords: wb97x-d3
keywords: def2-TZVPP
keywords: def2/J RIJCOSX
keywords: DEFGRID2
keywords: scfconv7
keywords: smallprint printgap noloewdin
keywords: NOSOSCF
formula: C9H18O2
InChI: InChI=1/C9H18O2/c1-2-3-4-5-6-7-8-9(10)11/h10H,2-8H2,1H3
29 atoms
O  -4.109524 -1.550133 -0.951599
O  -3.531325 -2.08994 1.132862
C  0.729471 0.491138 0.317662
C  2.02702 1.214716 -0.020491
C  -0.454794 0.981353 -0.507184
C  3.212501 0.723231 0.801834
C  -1.797382 0.379787 -0.103723
C  4.508244 1.489568 0.552007
C  -1.87306 -1.135493 -0.324537
C  5.057233 1.338581 -0.860665
C  -3.231101 -1.659215 0.053908
H  0.87412 -0.583899 0.171313
H  0.506658 0.622268 1.382353
H  2.234467 1.096516 -1.088504
H  1.895665 2.290163 0.143605
H  -0.525224 2.06917 -0.41301
H  -0.270331 0.784435 -1.568548
H  2.958142 0.792598 1.864045
H  3.377091 -0.341444 0.602686
H  -2.591609 0.865138 -0.675843
H  -1.993681 0.598237 0.949708
H  5.262632 1.14814 1.265463
H  4.348322 2.54986 0.770821
H  -1.136069 -1.64664 0.294106
H  -1.656344 -1.363488 -1.370509
H  4.385022 1.759263 -1.60893
H  5.21216 0.287741 -1.11231
H  6.016114 1.846086 -0.967914
H  -4.967671 -1.861065 -0.634339
totalener: -504.34234570 hartree
nucrepener: 605.34197120 hartree
electener: -1109.68431690 hartree
oneelecener: -1883.42472870 hartree
twoeener: 773.74041180 hartree
kineticenergy: 501.98550462 hartree
xcener: -49.760608033869 hartree
chargesum: -0.0000000
charge: -0.268662 -0.345984 -0.113215 -0.122247 -0.118732 -0.104130 -0.170327 -0.109224 -0.096898 -0.256894 0.306439 0.055545 0.062609 0.058315 0.056247 0.069944 0.062707 0.065216 0.058057 0.093585 0.085635 0.067837 0.051755 0.088912 0.086318 0.073785 0.074849 0.086372 0.202183
qa: -0.2687 -0.3460 -0.1132 -0.1222 -0.1187 -0.1041 -0.1703 -0.1092 -0.0969 -0.2569 0.3064 0.0555 0.0626 0.0583 0.0562 0.0699 0.0627 0.0652 0.0581 0.0936 0.0856 0.0678 0.0518 0.0889 0.0863 0.0738 0.0748 0.0864 0.2022
va: 2.1800 2.1469 3.8854 3.8903 3.8830 3.8875 3.9121 3.9054 3.7888 3.9322 4.2993 1.0105 1.0114 1.0090 1.0115 1.0137 1.0106 1.0133 1.0107 1.0172 1.0117 1.0082 1.0096 1.0282 1.0191 1.0015 1.0028 1.0066 1.0432
dispcorr: -0.009519255 hartree
energy: -504.351864959738
dipole: 22.32610 -22.10380 0.22230 10.32472 -9.91580 0.40892 -1.84761 1.26149 -0.58612
magnitude: 0.74844 au
magnitude: 1.90239 debye
