program: Orca
programVersion: 5.0.2
elementType: O O C C C C C C C C C H H H H H H H H H H H H H H H H H H
charge: 0
multiplicity: 1
keywords: wb97x-d3
keywords: def2-TZVPP
keywords: def2/J RIJCOSX
keywords: DEFGRID2
keywords: scfconv7
keywords: smallprint printgap noloewdin
keywords: NOSOSCF
formula: C9H18O2
InChI: InChI=1/C9H18O2/c1-2-3-4-5-6-7-8-9(10)11/h10H,2-8H2,1H3
29 atoms
O  -3.594606 -2.619087 0.798944
O  -3.379895 -1.697077 -1.219069
C  0.648563 1.65614 -0.679816
C  1.716771 2.515327 -0.007869
C  -0.060969 0.696387 0.266841
C  2.854229 1.744818 0.658429
C  -1.200336 -0.058302 -0.406639
C  3.637199 0.84341 -0.287571
C  -1.889145 -1.016736 0.549949
C  4.823149 0.172138 0.389188
C  -3.018034 -1.788852 -0.079231
H  -0.093085 2.318603 -1.13671
H  1.084498 1.090481 -1.508969
H  2.139167 3.196302 -0.75316
H  1.237155 3.152881 0.741379
H  0.655453 -0.023705 0.675876
H  -0.44653 1.255446 1.126987
H  3.541564 2.465449 1.112662
H  2.467937 1.147486 1.4906
H  -0.818056 -0.609963 -1.268957
H  -1.928469 0.65187 -0.805948
H  3.985695 1.431326 -1.142485
H  2.978905 0.074651 -0.701959
H  -2.284091 -0.478984 1.418031
H  -1.172868 -1.734659 0.962819
H  5.525717 0.909554 0.780693
H  5.370311 -0.46895 -0.302125
H  4.501288 -0.448348 1.227315
H  -4.308669 -3.086494 0.345872
totalener: -504.34365868 hartree
nucrepener: 611.89258713 hartree
electener: -1116.23624581 hartree
oneelecener: -1896.61773513 hartree
twoeener: 780.38148932 hartree
kineticenergy: 501.98895382 hartree
xcener: -49.762708234469 hartree
chargesum: 0.0000000
charge: -0.271264 -0.345777 -0.124403 -0.155273 -0.117590 -0.130053 -0.084213 -0.088331 -0.143266 -0.255649 0.326239 0.074583 0.067632 0.074078 0.071016 0.052779 0.062017 0.071830 0.061769 0.068196 0.066902 0.060670 0.051851 0.087211 0.086537 0.072782 0.084908 0.072166 0.202654
qa: -0.2713 -0.3458 -0.1244 -0.1553 -0.1176 -0.1301 -0.0842 -0.0883 -0.1433 -0.2556 0.3262 0.0746 0.0676 0.0741 0.0710 0.0528 0.0620 0.0718 0.0618 0.0682 0.0669 0.0607 0.0519 0.0872 0.0865 0.0728 0.0849 0.0722 0.2027
va: 2.1905 2.1435 3.8782 3.9157 3.8582 3.8716 3.8797 3.8669 3.8194 3.9551 4.2959 1.0135 1.0046 1.0093 1.0096 1.0072 1.0104 1.0113 1.0031 1.0213 1.0225 1.0080 1.0057 1.0199 1.0202 1.0043 1.0055 1.0031 1.0430
dispcorr: -0.009734874 hartree
energy: -504.353393554448
dipole: 20.81206 -20.59157 0.22049 10.20501 -10.20866 -0.00365 2.07287 -1.49109 0.58178
magnitude: 0.62217 au
magnitude: 1.58142 debye
