program: Orca
programVersion: 5.0.2
elementType: Cl Cl O O N C C C C C C C C C C C C C C C C C C C C H H H H H H H H H H H H H H H H H H H
charge: 0
multiplicity: 1
keywords: wb97x-d3
keywords: def2-TZVPP
keywords: def2/J RIJCOSX
keywords: DEFGRID2
keywords: scfconv7
keywords: smallprint printgap noloewdin
keywords: NOSOSCF
formula: C20H19Cl2NO2
InChI: InChI=1/C20H19Cl2NO2/c1-13-18(14-7-5-4-6-8-14)19(24)23(12-25-13)20(2,3)15-9-16(21)11-17(22)10-15/h4-11H,12H2,1-3H3
44 atoms
Cl 2.150268 -0.919225 3.19553
Cl 4.779069 -1.627394 -1.431572
O  -1.953965 2.493331 1.005429
O  -0.475349 -0.333207 -1.381057
N  -0.386204 1.79545 -0.587191
C  1.027272 1.9945 -0.961267
C  1.840856 0.845652 -0.36937
C  1.581049 3.277253 -0.330222
C  1.156848 2.12511 -2.479137
C  -1.254416 2.858394 -0.169625
C  -0.997455 0.592547 -0.768623
C  -2.294692 0.447099 -0.085526
C  -2.63821 1.344016 0.867809
C  2.816313 0.185092 -1.102704
C  1.644168 0.502587 0.966557
C  -3.094431 -0.772227 -0.32396
C  2.411461 -0.495304 1.537021
C  3.572215 -0.807881 -0.498497
C  -3.726667 1.202563 1.866731
C  3.389791 -1.170859 0.823458
C  -2.578735 -2.045226 -0.073204
C  -4.405135 -0.662834 -0.786915
C  -3.354972 -3.175469 -0.28236
C  -5.185095 -1.79333 -0.99071
C  -4.660301 -3.054254 -0.743118
H  1.419991 3.315596 0.747701
H  2.65568 3.311216 -0.506569
H  1.154531 4.173231 -0.783071
H  2.175177 2.39103 -2.766182
H  0.504885 2.929692 -2.821423
H  0.879032 1.215491 -3.008984
H  -0.699937 3.75937 0.061149
H  -1.99509 3.086553 -0.944693
H  2.990985 0.425775 -2.14159
H  0.888214 1.005319 1.556643
H  -4.089485 0.181333 1.934708
H  -4.567653 1.849826 1.609701
H  -3.371224 1.512784 2.85072
H  3.983317 -1.950362 1.280509
H  -1.572879 -2.15618 0.309534
H  -4.817629 0.318479 -0.988645
H  -2.940609 -4.15481 -0.077813
H  -6.202302 -1.687176 -1.345424
H  -5.264776 -3.937473 -0.903976
elementType: Cl O N C H
totalener: -1899.29048842 hartree
nucrepener: 2498.84317585 hartree
electener: -4398.13366427 hartree
oneelecener: -7571.74428364 hartree
twoeener: 3173.61061937 hartree
cpcmener: -0.03955327 hartree
kineticenergy: 1893.65202310 hartree
xcener: -138.334790820544 hartree
chargesum: 0.0000000
charge: -0.086558 -0.086023 -0.321980 -0.551677 -0.106736 0.402231 -0.090049 -0.345971 -0.346642 0.066537 0.343670 -0.015404 0.267775 -0.171505 -0.213064 -0.012469 0.073296 0.099915 -0.257132 -0.164327 -0.206579 -0.202490 -0.185140 -0.176819 -0.148769 0.123543 0.117824 0.117285 0.107827 0.110259 0.109826 0.132004 0.127875 0.130783 0.127217 0.105787 0.117764 0.114073 0.127250 0.141284 0.148018 0.158070 0.158496 0.160728
qa: -0.0866 -0.0860 -0.3220 -0.5517 -0.1067 0.4022 -0.0900 -0.3460 -0.3466 0.0665 0.3437 -0.0154 0.2678 -0.1715 -0.2131 -0.0125 0.0733 0.0999 -0.2571 -0.1643 -0.2066 -0.2025 -0.1851 -0.1768 -0.1488 0.1235 0.1178 0.1173 0.1078 0.1103 0.1098 0.1320 0.1279 0.1308 0.1272 0.1058 0.1178 0.1141 0.1272 0.1413 0.1480 0.1581 0.1585 0.1607
va: 1.2194 1.2197 2.0978 1.9452 3.0996 3.5767 3.7337 3.9345 3.9338 3.9523 4.1621 3.3384 3.7898 4.0238 4.0502 3.4122 3.9229 3.9204 3.9629 4.0518 3.9521 3.9336 3.9225 3.9122 3.8781 0.9938 1.0022 0.9958 0.9990 1.0038 1.0146 0.9918 0.9969 1.0234 1.0377 1.0022 0.9977 1.0063 1.0183 1.0181 1.0049 0.9930 0.9923 0.9894
dispcorr: -0.025562602 hartree
energy: -1899.316051020124
dipole: -27.25176 26.00798 -1.24378 18.00828 -15.06859 2.93969 -7.76273 8.20387 0.44114
magnitude: 3.22232 au
magnitude: 8.19049 debye
