program: Orca
programVersion: 5.0.2
elementType: Cl Cl O O N C C C C C C C C C C C C C C C C C C C C H H H H H H H H H H H H H H H H H H H
charge: 0
multiplicity: 1
keywords: wb97x-d3
keywords: def2-TZVPP
keywords: def2/J RIJCOSX
keywords: DEFGRID2
keywords: scfconv7
keywords: smallprint printgap noloewdin
keywords: NOSOSCF
formula: C20H19Cl2NO2
InChI: InChI=1/C20H19Cl2NO2/c1-13-18(14-7-5-4-6-8-14)19(24)23(12-25-13)20(2,3)15-9-16(21)11-17(22)10-15/h4-11H,12H2,1-3H3
44 atoms
Cl 2.407219 -1.600433 -3.000932
Cl 4.93271 -1.205503 1.721421
O  -2.323564 2.80089 -0.74291
O  -0.495382 -0.15044 1.147305
N  -0.334189 1.792123 -0.019979
C  1.043505 2.05603 0.441783
C  1.916371 0.845182 0.114014
C  1.021091 2.412567 1.929799
C  1.65911 3.243297 -0.306521
C  -0.978815 2.533155 -1.072439
C  -0.997919 0.681074 0.404532
C  -2.410096 0.582641 -0.021039
C  -3.035294 1.691574 -0.469639
C  2.896944 0.396728 0.988355
C  1.782086 0.227314 -1.126796
C  -3.103185 -0.690557 0.265978
C  2.604122 -0.832192 -1.461016
C  3.7133 -0.66135 0.61911
C  -4.490417 1.875791 -0.702087
C  3.583751 -1.301321 -0.599983
C  -2.700297 -1.858432 -0.382185
C  -4.148091 -0.764298 1.184789
C  -3.340669 -3.062874 -0.134427
C  -4.794034 -1.968692 1.430276
C  -4.392392 -3.12155 0.771035
H  0.330913 3.241928 2.085398
H  0.706089 1.585314 2.562139
H  2.001868 2.74511 2.269616
H  1.14097 4.177868 -0.085686
H  1.682185 3.099031 -1.387569
H  2.690192 3.360107 0.025791
H  -0.505033 3.495048 -1.225387
H  -0.964012 1.974149 -2.017491
H  3.032593 0.856604 1.956956
H  1.033211 0.560926 -1.833747
H  -5.033608 0.936353 -0.656685
H  -4.663663 2.331051 -1.678315
H  -4.915049 2.546171 0.049051
H  4.219362 -2.133062 -0.869709
H  -1.885444 -1.821758 -1.095462
H  -4.458111 0.126875 1.717128
H  -3.018009 -3.958446 -0.650079
H  -5.608071 -2.005545 2.143099
H  -4.893789 -4.061713 0.96231
elementType: Cl O N C H
totalener: -1899.30188900 hartree
nucrepener: 2483.26742516 hartree
electener: -4382.56931416 hartree
oneelecener: -7540.29104428 hartree
twoeener: 3157.72173011 hartree
cpcmener: -0.03405597 hartree
kineticenergy: 1893.65237858 hartree
xcener: -138.333517063614 hartree
chargesum: -0.0000000
charge: -0.084617 -0.084651 -0.313980 -0.511519 -0.108892 0.372613 -0.042885 -0.357244 -0.334057 0.059877 0.287407 0.007791 0.230968 -0.163408 -0.232149 0.031593 0.083658 0.097792 -0.263290 -0.167698 -0.186806 -0.228229 -0.180226 -0.174513 -0.142132 0.107473 0.121726 0.103035 0.116820 0.121368 0.114818 0.126260 0.122186 0.126975 0.125696 0.108632 0.109447 0.117036 0.126566 0.137147 0.152783 0.154530 0.154447 0.157651
qa: -0.0846 -0.0847 -0.3140 -0.5115 -0.1089 0.3726 -0.0429 -0.3572 -0.3341 0.0599 0.2874 0.0078 0.2310 -0.1634 -0.2321 0.0316 0.0837 0.0978 -0.2633 -0.1677 -0.1868 -0.2282 -0.1802 -0.1745 -0.1421 0.1075 0.1217 0.1030 0.1168 0.1214 0.1148 0.1263 0.1222 0.1270 0.1257 0.1086 0.1094 0.1170 0.1266 0.1371 0.1528 0.1545 0.1544 0.1577
va: 1.2226 1.2207 2.1096 1.9963 3.0905 3.6066 3.7360 3.9268 3.9308 3.9637 4.2884 3.2390 3.8833 4.0253 4.0353 3.4186 3.9351 3.9234 3.9694 4.0534 3.9492 3.9473 3.9187 3.9206 3.8825 1.0090 1.0121 0.9994 0.9957 0.9934 1.0040 0.9912 0.9940 1.0239 1.0309 1.0034 1.0076 0.9967 1.0183 1.0099 0.9992 0.9935 0.9937 0.9902
dispcorr: -0.025110693 hartree
energy: -1899.326999697702
dipole: -28.66726 27.63405 -1.03321 19.30639 -16.85050 2.45589 4.43413 -5.53709 -1.10295
magnitude: 2.88364 au
magnitude: 7.32964 debye
