program: Orca
programVersion: 5.0.2
elementType: Cl Cl O O N C C C C C C C C C C C C C C C C C C C C H H H H H H H H H H H H H H H H H H H
charge: 0
multiplicity: 1
keywords: wb97x-d3
keywords: def2-TZVPP
keywords: def2/J RIJCOSX
keywords: DEFGRID2
keywords: scfconv7
keywords: smallprint printgap noloewdin
keywords: NOSOSCF
formula: C20H19Cl2NO2
InChI: InChI=1/C20H19Cl2NO2/c1-13-18(14-7-5-4-6-8-14)19(24)23(12-25-13)20(2,3)15-9-16(21)11-17(22)10-15/h4-11H,12H2,1-3H3
44 atoms
Cl 4.421361 -1.190267 2.588963
Cl 2.739717 -1.451066 -2.500884
O  -1.643206 2.164768 -1.887179
O  -0.749643 -0.037628 1.303086
N  -0.44628 1.865579 0.097464
C  0.851701 2.156234 0.725715
C  1.756176 0.939528 0.534373
C  0.65399 2.540731 2.194705
C  1.548755 3.326433 0.020071
C  -1.187755 2.785522 -0.706813
C  -1.121241 0.71058 0.426372
C  -2.263686 0.402767 -0.464781
C  -2.367358 1.056122 -1.642143
C  1.823322 0.346871 -0.722559
C  2.565615 0.459133 1.55211
C  -3.13017 -0.743704 -0.126725
C  3.421179 -0.603398 1.307942
C  2.679008 -0.716333 -0.93776
C  -3.209695 0.663078 -2.804172
C  3.49374 -1.210683 0.067926
C  -4.50658 -0.563539 -0.01158
C  -2.603858 -2.019013 0.074513
C  -5.343117 -1.630312 0.28217
C  -3.438864 -3.084237 0.369259
C  -4.809764 -2.895096 0.474089
H  -0.048188 3.372953 2.257866
H  0.259273 1.716353 2.783309
H  1.587618 2.878564 2.645826
H  1.03822 4.276336 0.190179
H  1.649893 3.166669 -1.053975
H  2.553654 3.42831 0.427083
H  -2.068145 3.16313 -0.167332
H  -0.575865 3.62735 -1.011623
H  1.192938 0.697405 -1.529386
H  2.528095 0.883599 2.544256
H  -2.60807 0.677335 -3.714597
H  -4.029099 1.368978 -2.951746
H  -3.62908 -0.330412 -2.678095
H  4.158681 -2.043174 -0.109574
H  -4.9239 0.427286 -0.144258
H  -1.538208 -2.179156 -0.00564
H  -6.409814 -1.46995 0.369014
H  -3.015582 -4.068717 0.519363
H  -5.457847 -3.729575 0.707708
totalener: -1899.27548357 hartree
nucrepener: 2498.85468322 hartree
electener: -4398.13016678 hartree
oneelecener: -7570.68460350 hartree
twoeener: 3172.55443672 hartree
kineticenergy: 1893.71194393 hartree
xcener: -138.339928937425 hartree
chargesum: -0.0000000
charge: -0.070670 -0.072384 -0.285059 -0.388230 -0.118001 0.327651 -0.013521 -0.334182 -0.332422 0.032923 0.286685 -0.043307 0.226452 -0.214890 -0.145856 0.020456 0.093216 0.069100 -0.251498 -0.165332 -0.196118 -0.125954 -0.142428 -0.153203 -0.108002 0.090058 0.134722 0.089404 0.099730 0.116719 0.110882 0.107883 0.111993 0.110638 0.105788 0.106495 0.098966 0.110043 0.112043 0.114846 0.115946 0.121394 0.123179 0.123842
qa: -0.0707 -0.0724 -0.2851 -0.3882 -0.1180 0.3277 -0.0135 -0.3342 -0.3324 0.0329 0.2867 -0.0433 0.2265 -0.2149 -0.1459 0.0205 0.0932 0.0691 -0.2515 -0.1653 -0.1961 -0.1260 -0.1424 -0.1532 -0.1080 0.0901 0.1347 0.0894 0.0997 0.1167 0.1109 0.1079 0.1120 0.1106 0.1058 0.1065 0.0990 0.1100 0.1120 0.1148 0.1159 0.1214 0.1232 0.1238
va: 1.2361 1.2355 2.1207 2.1149 3.0165 3.7190 3.6965 3.9063 3.9350 4.0085 4.1876 3.4085 3.7694 4.0723 4.0633 3.4802 3.9986 3.9922 3.9668 4.0767 3.9856 4.0053 3.9795 3.9817 3.9408 1.0092 1.0137 1.0032 0.9980 0.9953 1.0101 0.9974 0.9925 1.0420 1.0311 1.0079 1.0018 1.0048 1.0223 1.0126 1.0244 1.0028 1.0026 1.0000
dispcorr: -0.025477414 hartree
energy: -1899.300960979157
dipole: -28.08908 27.33349 -0.75559 18.24447 -16.67381 1.57066 -1.05442 0.45137 -0.60305
magnitude: 1.84433 au
magnitude: 4.68792 debye
