program: Orca
programVersion: 5.0.2
elementType: Cl Cl O O N C C C C C C C C C C C C C C C C C C C C H H H H H H H H H H H H H H H H H H H
charge: 0
multiplicity: 1
keywords: wb97x-d3
keywords: def2-TZVPP
keywords: def2/J RIJCOSX
keywords: DEFGRID2
keywords: scfconv7
keywords: smallprint printgap noloewdin
keywords: NOSOSCF
formula: C20H19Cl2NO2
InChI: InChI=1/C20H19Cl2NO2/c1-13-18(14-7-5-4-6-8-14)19(24)23(12-25-13)20(2,3)15-9-16(21)11-17(22)10-15/h4-11H,12H2,1-3H3
44 atoms
Cl 5.179212 2.630946 1.316066
Cl 3.761985 -1.260549 -2.092239
O  -0.801438 0.903655 -1.629569
O  -2.153561 -0.882362 1.693321
N  -0.515377 0.307328 0.61307
C  0.513605 0.267453 1.666163
C  1.863715 0.450318 0.970045
C  0.588298 -1.096393 2.370646
C  0.22293 1.350434 2.706731
C  -0.488467 1.378137 -0.344025
C  -1.752955 -0.296961 0.712801
C  -2.53682 -0.243469 -0.548129
C  -1.97793 0.253791 -1.671357
C  2.171207 -0.365495 -0.1178
C  2.803032 1.371635 1.408777
C  -3.853643 -0.91529 -0.533191
C  4.028139 1.469591 0.763135
C  3.397371 -0.248629 -0.742491
C  -2.529331 0.177874 -3.051949
C  4.34667 0.668734 -0.316176
C  -4.069447 -2.092734 -1.243034
C  -4.903309 -0.383701 0.21063
C  -5.311326 -2.710473 -1.234209
C  -6.143373 -1.000759 0.225602
C  -6.353068 -2.163865 -0.501377
H  -0.255762 -1.266111 3.030405
H  0.632645 -1.917205 1.655584
H  1.504143 -1.124877 2.96184
H  -0.770708 1.185637 3.120856
H  0.250536 2.355264 2.280209
H  0.930391 1.315679 3.535745
H  -1.215959 2.162881 -0.088023
H  0.501492 1.822488 -0.39922
H  1.44704 -1.07959 -0.485537
H  2.598375 2.024528 2.244561
H  -2.520002 1.163269 -3.518554
H  -3.544865 -0.205422 -3.058398
H  -1.913737 -0.476893 -3.671947
H  5.301109 0.756216 -0.814596
H  -3.252418 -2.534092 -1.800463
H  -4.747117 0.524122 0.778572
H  -5.46112 -3.624637 -1.793548
H  -6.949145 -0.5733 0.807748
H  -7.321781 -2.645814 -0.490426
totalener: -1899.27348862 hartree
nucrepener: 2446.80949792 hartree
electener: -4346.08298654 hartree
oneelecener: -7466.03928234 hartree
twoeener: 3119.95629580 hartree
kineticenergy: 1893.70927528 hartree
xcener: -138.337553585391 hartree
chargesum: 0.0000000
charge: -0.062072 -0.061143 -0.281905 -0.388281 -0.113979 0.361370 -0.158565 -0.302962 -0.357696 0.032332 0.257689 -0.059641 0.222541 -0.169200 -0.127820 0.075533 0.080823 0.058102 -0.257192 -0.143990 -0.220649 -0.128255 -0.140702 -0.154103 -0.105793 0.126654 0.103888 0.102662 0.119990 0.097201 0.097997 0.115412 0.125766 0.112695 0.117631 0.100781 0.110117 0.104743 0.115007 0.124441 0.103833 0.122259 0.120649 0.123835
qa: -0.0621 -0.0611 -0.2819 -0.3883 -0.1140 0.3614 -0.1586 -0.3030 -0.3577 0.0323 0.2577 -0.0596 0.2225 -0.1692 -0.1278 0.0755 0.0808 0.0581 -0.2572 -0.1440 -0.2206 -0.1283 -0.1407 -0.1541 -0.1058 0.1267 0.1039 0.1027 0.1200 0.0972 0.0980 0.1154 0.1258 0.1127 0.1176 0.1008 0.1101 0.1047 0.1150 0.1244 0.1038 0.1223 0.1206 0.1238
va: 1.2458 1.2463 2.1334 2.1181 3.0038 3.6923 3.7630 3.9021 3.9536 3.9613 4.2724 3.3653 3.8223 4.0625 3.9750 3.4812 4.0039 3.9995 3.9621 4.0491 3.9997 4.0045 3.9756 3.9809 3.9416 1.0201 1.0040 0.9987 1.0157 0.9971 1.0030 0.9991 0.9911 1.0413 1.0273 1.0101 1.0053 0.9994 1.0222 1.0066 1.0181 1.0026 1.0030 1.0000
dispcorr: -0.025027912 hartree
energy: -1899.298516531365
dipole: -35.20011 35.03516 -0.16495 -3.90241 4.57381 0.67140 5.26913 -5.69232 -0.42319
magnitude: 0.81060 au
magnitude: 2.06039 debye
