program: Orca
programVersion: 5.0.2
elementType: O O N C C C C C C C C C C C C C C C C C H H H H H H H H H H H H H H H H H H H H H
charge: 0
multiplicity: 1
keywords: wb97x-d3
keywords: def2-TZVPP
keywords: def2/J RIJCOSX
keywords: DEFGRID2
keywords: scfconv7
keywords: smallprint printgap noloewdin
keywords: NOSOSCF
formula: C17H21NO2
InChI: InChI=1/C17H21NO2/c1-4-18(5-2)17(19)13(3)20-16-12-8-10-14-9-6-7-11-15(14)16/h6-13H,4-5H2,1-3H3
41 atoms
O  0.039788 -0.326109 0.192349
O  -1.832261 -1.688446 -0.988289
N  -3.246348 0.070105 -0.997818
C  -1.278943 0.09542 0.48512
C  -2.145116 -0.576588 -0.583043
C  -4.120361 -0.569271 -1.973592
C  -3.648802 1.39794 -0.551578
C  1.096468 0.330202 0.704306
C  2.363802 -0.227343 0.353064
C  -1.724738 -0.381167 1.860492
C  3.542715 0.400762 0.830352
C  -5.231313 -1.373718 -1.321236
C  -3.084575 2.508991 -1.41951
C  1.030798 1.452607 1.492303
C  2.478187 -1.381317 -0.456423
C  3.443452 1.557278 1.640316
C  2.215498 2.060421 1.956509
C  4.797669 -0.148888 0.48051
C  3.710129 -1.885786 -0.77813
C  4.88194 -1.265438 -0.305122
H  -1.336373 1.183829 0.415744
H  -4.544694 0.216023 -2.601194
H  -3.527216 -1.203384 -2.630084
H  -4.739124 1.428369 -0.572483
H  -3.380863 1.551249 0.492749
H  -2.757385 -0.087628 2.051586
H  -1.110821 0.044265 2.653691
H  -1.664869 -1.467886 1.925771
H  -5.873914 -1.815394 -2.083948
H  -4.829437 -2.18423 -0.712528
H  -5.857986 -0.747846 -0.683752
H  -1.994161 2.529265 -1.385577
H  -3.38599 2.390071 -2.461249
H  -3.449125 3.477864 -1.076469
H  0.085269 1.893975 1.775767
H  1.589405 -1.873261 -0.827828
H  4.347678 2.030748 2.00209
H  2.132989 2.943443 2.577154
H  5.696508 0.332477 0.847124
H  3.783653 -2.768916 -1.399552
H  5.849669 -1.675029 -0.564989
elementType: O N C H
totalener: -865.76917903 hartree
nucrepener: 1533.44377790 hartree
electener: -2399.21295693 hartree
oneelecener: -4220.58617992 hartree
twoeener: 1821.37322300 hartree
cpcmener: -0.03348211 hartree
kineticenergy: 861.82118855 hartree
xcener: -85.390736572552 hartree
chargesum: 0.0000000
charge: -0.305293 -0.537948 -0.118439 0.099636 0.336825 -0.037174 -0.049432 0.416896 -0.090222 -0.277160 -0.049810 -0.252326 -0.251620 -0.259420 -0.227483 -0.183388 -0.152220 -0.099830 -0.141517 -0.153603 0.089436 0.095818 0.085789 0.104991 0.096675 0.104326 0.105762 0.108123 0.095170 0.086831 0.079862 0.084168 0.086152 0.093358 0.132602 0.138644 0.139566 0.154566 0.140391 0.155283 0.156011
qa: -0.3053 -0.5379 -0.1184 0.0996 0.3368 -0.0372 -0.0494 0.4169 -0.0902 -0.2772 -0.0498 -0.2523 -0.2516 -0.2594 -0.2275 -0.1834 -0.1522 -0.0998 -0.1415 -0.1536 0.0894 0.0958 0.0858 0.1050 0.0967 0.1043 0.1058 0.1081 0.0952 0.0868 0.0799 0.0842 0.0862 0.0934 0.1326 0.1386 0.1396 0.1546 0.1404 0.1553 0.1560
va: 2.0958 1.9663 3.1926 3.9403 4.1219 3.8704 3.9053 3.6877 3.7842 3.9154 3.8754 3.9221 3.9263 3.8821 3.9729 3.9399 3.9416 3.8693 3.9208 3.9135 0.9995 0.9969 1.0217 0.9935 0.9938 1.0075 1.0019 1.0130 1.0066 1.0072 1.0049 1.0018 1.0041 1.0074 1.0095 1.0343 1.0060 0.9916 1.0055 0.9932 0.9909
dispcorr: -0.018264363 hartree
energy: -865.787443389255
dipole: -23.51836 21.66578 -1.85259 5.86179 -3.66657 2.19523 -2.13651 2.69280 0.55629
magnitude: 2.92584 au
magnitude: 7.43690 debye
