program: Orca
programVersion: 5.0.2
elementType: O O N C C C C C C C C C C C C C C C C C H H H H H H H H H H H H H H H H H H H H H
charge: 0
multiplicity: 1
keywords: wb97x-d3
keywords: def2-TZVPP
keywords: def2/J RIJCOSX
keywords: DEFGRID2
keywords: scfconv7
keywords: smallprint printgap noloewdin
keywords: NOSOSCF
formula: C17H21NO2
InChI: InChI=1/C17H21NO2/c1-4-18(5-2)17(19)13(3)20-16-12-8-10-14-9-6-7-11-15(14)16/h6-13H,4-5H2,1-3H3
41 atoms
O  0.238909 -1.134488 0.084956
O  -1.113816 0.395359 -1.576874
N  -2.9906 0.460171 -0.338213
C  -1.16013 -1.110897 0.267031
C  -1.762172 -0.007096 -0.619723
C  -3.547696 1.491139 -1.210072
C  -3.822569 0.041294 0.782065
C  0.997482 -0.140456 0.584483
C  2.39106 -0.251749 0.298716
C  -1.676737 -2.472537 -0.163853
C  3.272362 0.739095 0.801814
C  -4.07976 0.978082 -2.538438
C  -5.092451 -0.679849 0.365217
C  0.525755 0.909854 1.331668
C  2.919478 -1.313322 -0.471514
C  2.758145 1.810555 1.569965
C  1.419257 1.884289 1.821304
C  4.653727 0.631671 0.518503
C  4.262494 -1.386281 -0.728132
C  5.140057 -0.405049 -0.229301
H  -1.383059 -0.95513 1.326473
H  -4.353623 1.974323 -0.656499
H  -2.792291 2.25865 -1.384442
H  -3.253201 -0.59693 1.451464
H  -4.080979 0.930608 1.362617
H  -1.223986 -3.258157 0.441296
H  -1.449638 -2.664495 -1.213062
H  -2.756314 -2.538496 -0.036034
H  -4.860734 0.230213 -2.402201
H  -4.512444 1.808119 -3.099364
H  -3.293999 0.541355 -3.152937
H  -5.643717 -0.984159 1.255749
H  -5.753659 -0.043822 -0.223585
H  -4.874068 -1.575976 -0.216353
H  -0.525199 1.019735 1.563851
H  2.26434 -2.077047 -0.867317
H  3.436399 2.564541 1.949145
H  1.020192 2.703129 2.406009
H  5.323945 1.390098 0.905128
H  4.652078 -2.203703 -1.320931
H  6.199505 -0.473633 -0.440352
elementType: O N C H
totalener: -865.77038310 hartree
nucrepener: 1552.92043797 hartree
electener: -2418.69082107 hartree
oneelecener: -4259.90262389 hartree
twoeener: 1841.21180282 hartree
cpcmener: -0.03410818 hartree
kineticenergy: 861.82011134 hartree
xcener: -85.391681383522 hartree
chargesum: -0.0000000
charge: -0.307373 -0.522819 -0.102312 0.143423 0.260148 -0.048311 -0.063116 0.398338 -0.088500 -0.289865 -0.057367 -0.258712 -0.261643 -0.235142 -0.235593 -0.176407 -0.158759 -0.098857 -0.139976 -0.153005 0.116845 0.094428 0.092310 0.101146 0.097472 0.105944 0.108312 0.107425 0.084035 0.097266 0.089337 0.099668 0.094226 0.087502 0.128764 0.145801 0.140097 0.153691 0.140734 0.155077 0.155769
qa: -0.3074 -0.5228 -0.1023 0.1434 0.2601 -0.0483 -0.0631 0.3983 -0.0885 -0.2899 -0.0574 -0.2587 -0.2616 -0.2351 -0.2356 -0.1764 -0.1588 -0.0989 -0.1400 -0.1530 0.1168 0.0944 0.0923 0.1011 0.0975 0.1059 0.1083 0.1074 0.0840 0.0973 0.0893 0.0997 0.0942 0.0875 0.1288 0.1458 0.1401 0.1537 0.1407 0.1551 0.1558
va: 2.0873 1.9829 3.1553 3.8352 4.0386 3.8661 3.8993 3.6887 3.8054 3.9388 3.8777 3.8952 3.9092 3.8807 3.9848 3.9363 3.9537 3.8679 3.9158 3.9159 0.9954 0.9988 1.0140 1.0000 0.9974 1.0075 1.0063 1.0028 1.0024 1.0055 1.0144 1.0087 0.9975 1.0020 1.0172 1.0213 1.0055 0.9924 1.0056 0.9935 0.9910
dispcorr: -0.019102198 hartree
energy: -865.789485295330
dipole: -26.34842 23.92067 -2.42776 -1.93216 1.68517 -0.24699 -2.05580 3.61223 1.55644
magnitude: 2.89439 au
magnitude: 7.35696 debye
