program: Orca
programVersion: 5.0.2
elementType: O O N C C C C C C C C C C C C C C C C C H H H H H H H H H H H H H H H H H H H H H
charge: 0
multiplicity: 1
keywords: wb97x-d3
keywords: def2-TZVPP
keywords: def2/J RIJCOSX
keywords: DEFGRID2
keywords: scfconv7
keywords: smallprint printgap noloewdin
keywords: NOSOSCF
formula: C17H21NO2
InChI: InChI=1/C17H21NO2/c1-4-18(5-2)17(19)13(3)20-16-12-8-10-14-9-6-7-11-15(14)16/h6-13H,4-5H2,1-3H3
41 atoms
O  -0.356369 -0.440127 0.570311
O  -3.436547 -1.494592 0.337466
N  -2.778872 0.308458 -0.833154
C  -1.592666 -0.279237 1.255458
C  -2.680028 -0.540529 0.204646
C  -3.801194 0.041596 -1.841405
C  -1.967725 1.500772 -1.039789
C  0.76569 0.154993 1.023393
C  1.94035 -0.133244 0.265092
C  -1.69276 -1.230698 2.427543
C  3.16543 0.469915 0.650366
C  -3.457242 -1.08786 -2.797929
C  -1.007116 1.392089 -2.211594
C  0.832192 0.98926 2.111025
C  1.923403 -0.998586 -0.853466
C  3.202018 1.332153 1.771837
C  2.060764 1.576454 2.477659
C  4.329644 0.191619 -0.102223
C  3.069463 -1.245879 -1.560794
C  4.285329 -0.645217 -1.182971
H  -1.704441 0.749232 1.616416
H  -4.751645 -0.164685 -1.346568
H  -3.942041 0.965228 -2.403406
H  -2.650189 2.337911 -1.208296
H  -1.419993 1.751619 -0.135334
H  -2.639394 -1.095178 2.9497
H  -0.897235 -1.033303 3.146126
H  -1.619066 -2.270707 2.112249
H  -4.24602 -1.186195 -3.545342
H  -2.522463 -0.89786 -3.325872
H  -3.369073 -2.044621 -2.285316
H  -1.532604 1.278225 -3.160502
H  -0.408837 2.301685 -2.278643
H  -0.324189 0.550553 -2.09844
H  -0.039029 1.211372 2.711497
H  1.001585 -1.475929 -1.15629
H  4.141388 1.786794 2.060836
H  2.082974 2.230531 3.339844
H  5.263366 0.654311 0.194492
H  3.041835 -1.909944 -2.414984
H  5.184671 -0.848916 -1.749849
elementType: O N C H
totalener: -865.76815847 hartree
nucrepener: 1578.08285582 hartree
electener: -2443.85101430 hartree
oneelecener: -4309.40259239 hartree
twoeener: 1865.55157810 hartree
cpcmener: -0.02631240 hartree
kineticenergy: 861.81443300 hartree
xcener: -85.389193840268 hartree
chargesum: -0.0000000
charge: -0.317786 -0.528027 -0.108484 0.077365 0.320011 -0.041655 -0.021880 0.392981 -0.055636 -0.276394 -0.069430 -0.260610 -0.281837 -0.216916 -0.259694 -0.169531 -0.160450 -0.092699 -0.130454 -0.158076 0.111549 0.090609 0.093597 0.098293 0.085828 0.102874 0.099746 0.093558 0.097128 0.084094 0.089329 0.097360 0.101477 0.083374 0.133914 0.147601 0.140719 0.154957 0.141196 0.155798 0.156202
qa: -0.3178 -0.5280 -0.1085 0.0774 0.3200 -0.0417 -0.0219 0.3930 -0.0556 -0.2764 -0.0694 -0.2606 -0.2818 -0.2169 -0.2597 -0.1695 -0.1605 -0.0927 -0.1305 -0.1581 0.1115 0.0906 0.0936 0.0983 0.0858 0.1029 0.0997 0.0936 0.0971 0.0841 0.0893 0.0974 0.1015 0.0834 0.1339 0.1476 0.1407 0.1550 0.1412 0.1558 0.1562
va: 2.0429 1.9843 3.1855 3.7914 4.1639 3.8548 3.8773 3.6453 3.7494 3.9774 3.8983 3.9018 3.8984 3.8810 3.9473 3.9247 3.9404 3.8619 3.9138 3.9289 0.9911 1.0143 1.0001 0.9970 1.0031 1.0117 1.0024 1.0153 1.0054 1.0021 1.0134 1.0010 1.0086 1.0058 1.0105 1.0216 1.0052 0.9914 1.0054 0.9931 0.9908
dispcorr: -0.020286375 hartree
energy: -865.788444850120
dipole: -10.83369 11.28913 0.45544 3.11018 -1.17432 1.93585 -8.48456 8.10451 -0.38005
magnitude: 2.02470 au
magnitude: 5.14637 debye
