program: Orca
programVersion: 5.0.2
elementType: O O N C C C C C C C C C C C C C C C C C H H H H H H H H H H H H H H H H H H H H H
charge: 0
multiplicity: 1
keywords: wb97x-d3
keywords: def2-TZVPP
keywords: def2/J RIJCOSX
keywords: DEFGRID2
keywords: scfconv7
keywords: smallprint printgap noloewdin
keywords: NOSOSCF
formula: C17H21NO2
InChI: InChI=1/C17H21NO2/c1-4-18(5-2)17(19)13(3)20-16-12-8-10-14-9-6-7-11-15(14)16/h6-13H,4-5H2,1-3H3
41 atoms
O  0.155482 -1.217256 0.060221
O  -1.403705 -0.071185 -1.814514
N  -3.046501 0.393857 -0.339317
C  -1.226616 -1.172497 0.289935
C  -1.897703 -0.225269 -0.72044
C  -3.685032 1.290982 -1.290199
C  -3.756277 0.158807 0.904298
C  0.924289 -0.152226 0.35485
C  2.321978 -0.352584 0.160024
C  -1.73893 -2.590101 0.082608
C  3.211365 0.706775 0.465559
C  -4.616931 0.571636 -2.253057
C  -3.48426 1.207385 1.973314
C  0.457897 1.04656 0.829661
C  2.844527 -1.570483 -0.328348
C  2.700927 1.932503 0.953322
C  1.358747 2.088746 1.126256
C  4.596568 0.507803 0.274066
C  4.192153 -1.72993 -0.501091
C  5.078746 -0.681238 -0.19614
H  -1.412433 -0.85632 1.324634
H  -4.237849 2.039835 -0.718159
H  -2.914295 1.824547 -1.843566
H  -4.825217 0.136701 0.676802
H  -3.531937 -0.833795 1.291689
H  -1.248515 -3.277175 0.771127
H  -1.539475 -2.916365 -0.937373
H  -2.813705 -2.653136 0.251122
H  -5.101967 1.28663 -2.918176
H  -4.063903 -0.136461 -2.867697
H  -5.402482 0.02863 -1.724893
H  -3.699031 2.212357 1.609583
H  -4.109837 1.031628 2.848678
H  -2.444286 1.187282 2.299835
H  -0.597966 1.231496 0.967275
H  2.173193 -2.380893 -0.572354
H  3.38609 2.738725 1.18204
H  0.962963 3.026377 1.493778
H  5.275144 1.319352 0.50656
H  4.579455 -2.667363 -0.877715
H  6.142852 -0.817922 -0.337355
totalener: -865.74484584 hartree
nucrepener: 1560.36400344 hartree
electener: -2426.10884928 hartree
oneelecener: -4273.62066630 hartree
twoeener: 1847.51181701 hartree
kineticenergy: 861.86460503 hartree
xcener: -85.394105379401 hartree
chargesum: -0.0000000
charge: -0.282891 -0.378037 -0.119178 0.118712 0.213686 -0.043932 -0.099907 0.445414 -0.097445 -0.280517 -0.051019 -0.239852 -0.227078 -0.179447 -0.192828 -0.117407 -0.169957 -0.071783 -0.105287 -0.120466 0.090503 0.078333 0.097280 0.096443 0.086359 0.100306 0.115895 0.080642 0.086762 0.100971 0.061907 0.083350 0.095155 0.076410 0.063163 0.124839 0.102985 0.113209 0.104670 0.119265 0.120773
qa: -0.2829 -0.3780 -0.1192 0.1187 0.2137 -0.0439 -0.0999 0.4454 -0.0974 -0.2805 -0.0510 -0.2399 -0.2271 -0.1794 -0.1928 -0.1174 -0.1700 -0.0718 -0.1053 -0.1205 0.0905 0.0783 0.0973 0.0964 0.0864 0.1003 0.1159 0.0806 0.0868 0.1010 0.0619 0.0834 0.0952 0.0764 0.0632 0.1248 0.1030 0.1132 0.1047 0.1193 0.1208
va: 2.1304 2.1364 3.0917 3.8662 4.0794 3.9022 3.9521 3.6721 3.9129 3.9294 3.9655 3.9106 3.9030 3.8990 4.0176 3.9836 4.0831 3.9203 3.9539 3.9726 1.0024 0.9955 1.0174 0.9942 0.9986 1.0084 1.0098 1.0091 1.0099 1.0110 1.0070 1.0080 1.0116 1.0066 1.0513 1.0256 1.0144 1.0044 1.0142 1.0037 1.0012
dispcorr: -0.019314249 hartree
energy: -865.764160089175
dipole: -23.82764 22.29089 -1.53675 1.49352 -1.43856 0.05496 2.60122 -1.53768 1.06354
magnitude: 1.86969 au
magnitude: 4.75238 debye
