program: Orca
programVersion: 5.0.2
elementType: O O N C C C C C C C C C C C C C C C C C C C H H H H H H H H H H H H H H H H H
charge: 0
multiplicity: 1
keywords: wb97x-d3
keywords: def2-TZVPP
keywords: def2/J RIJCOSX
keywords: DEFGRID2
keywords: scfconv7
keywords: smallprint printgap noloewdin
keywords: NOSOSCF
formula: C19H17NO2
InChI: InChI=1/C19H17NO2/c1-14(19(21)20-17-9-3-2-4-10-17)22-18-12-11-15-7-5-6-8-16(15)13-18/h2-14,20H,1H3
39 atoms
O  0.29607 -2.021143 -0.58532
O  -2.419421 -1.685461 1.667974
N  -2.000977 -0.586526 -0.287788
C  -0.687026 -2.550537 0.283897
C  3.208087 0.146041 -0.584335
C  3.169832 0.69944 0.721914
C  1.217332 -1.139193 -0.108471
C  2.215613 -0.77415 -0.976842
C  2.132669 0.299016 1.589641
C  1.177231 -0.59869 1.196671
C  -1.784759 -1.544246 0.633601
C  -1.304932 -3.750915 -0.410934
C  4.251588 0.5371 -1.459409
C  4.164589 1.626279 1.113047
C  5.20017 1.433803 -1.052906
C  5.157815 1.987028 0.245783
C  -2.928077 0.464213 -0.281654
C  -3.882264 0.671493 0.714533
C  -2.867499 1.348792 -1.361143
C  -4.749798 1.75208 0.616167
C  -3.740825 2.418516 -1.446414
C  -4.690245 2.629985 -0.454841
H  -0.23773 -2.875567 1.227586
H  2.244076 -1.194696 -1.975252
H  0.409716 -0.875282 1.906256
H  -1.768322 -3.471899 -1.357428
H  -2.067528 -4.196499 0.225834
H  -0.545082 -4.507971 -0.601385
H  4.287578 0.113426 -2.45565
H  4.124533 2.047568 2.110354
H  -1.406565 -0.616017 -1.10587
H  5.993642 1.723583 -1.72943
H  5.915512 2.696977 0.549858
H  -3.963649 0.011167 1.561446
H  -2.128026 1.193779 -2.138231
H  -5.483028 1.902544 1.39782
H  -3.675751 3.089264 -2.292938
H  -5.37272 3.466779 -0.517698
H  2.092317 0.713303 2.589426
elementType: O N C H
totalener: -939.56868860 hartree
nucrepener: 1649.86222246 hartree
electener: -2589.43091107 hartree
oneelecener: -4551.29876676 hartree
twoeener: 1961.86785569 hartree
cpcmener: -0.03228482 hartree
kineticenergy: 935.40883929 hartree
xcener: -92.100572272191 hartree
chargesum: -0.0000000
charge: -0.345818 -0.527430 -0.108462 0.164717 -0.046362 -0.054032 0.290037 -0.197793 -0.175367 -0.141802 0.312317 -0.271855 -0.158025 -0.116827 -0.142155 -0.173424 0.209855 -0.254820 -0.235267 -0.134798 -0.114080 -0.200914 0.115424 0.130427 0.138446 0.106131 0.103660 0.104734 0.145450 0.147147 0.180334 0.159933 0.159511 0.156175 0.143524 0.159766 0.161631 0.161251 0.148761
qa: -0.3458 -0.5274 -0.1085 0.1647 -0.0464 -0.0540 0.2900 -0.1978 -0.1754 -0.1418 0.3123 -0.2719 -0.1580 -0.1168 -0.1422 -0.1734 0.2099 -0.2548 -0.2353 -0.1348 -0.1141 -0.2009 0.1154 0.1304 0.1384 0.1061 0.1037 0.1047 0.1454 0.1471 0.1803 0.1599 0.1595 0.1562 0.1435 0.1598 0.1616 0.1613 0.1488
va: 2.0412 1.9791 3.2700 3.7908 3.8926 3.8341 3.8043 4.0234 3.9750 3.8389 4.0278 3.9444 3.9006 3.8851 3.8883 3.9008 3.7504 3.9618 3.9502 3.9111 3.8820 3.9173 1.0134 1.0223 1.0231 1.0038 1.0100 1.0076 1.0052 1.0038 1.0164 0.9890 0.9900 1.0400 1.0080 0.9913 0.9889 0.9898 1.0047
dispcorr: -0.016587778 hartree
energy: -939.585276381763
dipole: -1.50261 2.09887 0.59626 -0.76919 1.05501 0.28582 -2.34162 1.10882 -1.23280
magnitude: 1.39894 au
magnitude: 3.55581 debye
